5,6,7,8,9,10-Hexahydrobenzocyclooctene
- Formula: C12H16
- Molecular weight: 160.2554
- IUPAC Standard InChIKey: ADKYNRATSQVVPJ-UHFFFAOYSA-N
- CAS Registry Number: 1076-69-3
- Chemical structure:
View 3d structure (requires JavaScript / HTML 5) - Species with the same structure:
- Other names: Benzocyclooctene,5,6,7,8,9,10-hexahydro-

Gas phase ion energetics data

Data compiled as indicated in comments:
LLK - Sharon G. Lias, Rhoda D. Levin, and Sherif A. Kafafi
RDSH - Henry M. Rosenstock, Keith Draxl, Bruce W. Steiner, and John T. Herron
Ionization energy determinations
IE (eV) | Method | Reference | Comment |
---|---|---|---|
8.97 ± 0.03 | EI | Meier, Heiss, et al., 1968 | RDSH |
8.42 | PE | Brogli, Giovannini, et al., 1973 | Vertical value; LLK |

References

Meier, Heiss, et al., 1968
Meier, H.; Heiss, J.; Suhr, H.; Muller, E.,
Energetische Untersuchungen zum Mills-Nixon-Effekt. Ionisierungsenergien von Benzolmolekulen mit ankondensierten gesattigten Ringen,
Tetrahedron, 1968, 24, 2307. [all data]
Brogli, Giovannini, et al., 1973
Brogli, F.; Giovannini, E.; Heilbronner, E.; Schurter, R.,
Die photoelektronen spektren der benzocycloalkene,
Chem. Ber., 1973, 106, 961. [all data]