5H-Benzocycloheptene,6,7,8,9-tetrahydro-
- Formula: C11H14
- Molecular weight: 146.2289
- IUPAC Standard InChIKey: HEOQXHNKRXRCTO-UHFFFAOYSA-N
- CAS Registry Number: 1075-16-7
- Chemical structure:
View 3d structure (requires JavaScript / HTML 5) - Other names: Benzocycloheptene

Gas phase ion energetics data

Data compiled as indicated in comments:
LLK - Sharon G. Lias, Rhoda D. Levin, and Sherif A. Kafafi
RDSH - Henry M. Rosenstock, Keith Draxl, Bruce W. Steiner, and John T. Herron
Ionization energy determinations
IE (eV) | Method | Reference | Comment |
---|---|---|---|
9.10 ± 0.05 | EI | Meier, Heiss, et al., 1968 | RDSH |
8.40 ± 0.02 | PE | Maier and Turner, 1973 | Vertical value; LLK |
8.44 | PE | Brogli, Giovannini, et al., 1973 | Vertical value; LLK |

References

Meier, Heiss, et al., 1968
Meier, H.; Heiss, J.; Suhr, H.; Muller, E.,
Energetische Untersuchungen zum Mills-Nixon-Effekt. Ionisierungsenergien von Benzolmolekulen mit ankondensierten gesattigten Ringen,
Tetrahedron, 1968, 24, 2307. [all data]
Maier and Turner, 1973
Maier, J.P.; Turner, D.W.,
Steric inhibition of resonance studied by molecular photoelectron spectroscopy. Part 2. Phenylethylenes,
J. Chem. Soc. Faraday Trans. 2, 1973, 69, 196. [all data]
Brogli, Giovannini, et al., 1973
Brogli, F.; Giovannini, E.; Heilbronner, E.; Schurter, R.,
Die photoelektronen spektren der benzocycloalkene,
Chem. Ber., 1973, 106, 961. [all data]
Humby and Stevens, 1970
Humby, C.M.; Stevens, R.D.S.,
Spectroscopy Letters, 1970, 3, 99. [all data]