Di-tert-butyl sulfide
- Formula: C8H18S
- Molecular weight: 146.294
- IUPAC Standard InChIKey: LNMBCRKRCIMQLW-UHFFFAOYSA-N
- CAS Registry Number: 107-47-1
- Chemical structure:
View 3d structure (requires JavaScript / HTML 5) - Other names: Propane, 2,2'-thiobis[2-methyl-; tert-Butyl sulfide; 2,2,4,4-Tetramethyl-3-thiapentane; 2,2'-Thiobis(2-methyl-propane); Di-tert-butyl sulphide; (tert-C4H9)2S; t-Butyl sulfide; 2-(tert-Butylsulfanyl)-2-methylpropane; NSC 4549

Condensed phase thermochemistry data

Data compiled by: Hussein Y. Afeefy, Joel F. Liebman, and Stephen E. Stein
Quantity | Value | Units | Method | Reference | Comment |
---|---|---|---|---|---|
ΔfH°liquid | -232.3 ± 1.1 | kJ/mol | Ccr | Good, 1972 | |
ΔfH°liquid | -232.7 ± 0.96 | kJ/mol | Ccb | Mackle and Mayrick, 1962 | Reanalyzed by Cox and Pilcher, 1970, Original value = -253. ± 2. kJ/mol |
Quantity | Value | Units | Method | Reference | Comment |
ΔcH°liquid | -6090.36 ± 0.92 | kJ/mol | Ccr | Good, 1972 | |
ΔcH°liquid | -6090.15 ± 0.75 | kJ/mol | Ccb | Mackle and Mayrick, 1962 | Reanalyzed by Cox and Pilcher, 1970, Original value = -6070. ± 2. kJ/mol |

Phase change data

Data compiled as indicated in comments:
BS - Robert L. Brown and Stephen E. Stein
ALS - Hussein Y. Afeefy, Joel F. Liebman, and Stephen E. Stein
DRB - Donald R. Burgess, Jr.
Quantity | Value | Units | Method | Reference | Comment |
---|---|---|---|---|---|
Tboil | 422.2 | K | N/A | Weast and Grasselli, 1989 | BS |
Tboil | 422.2 | K | N/A | Majer and Svoboda, 1985 | |
Quantity | Value | Units | Method | Reference | Comment |
ΔvapH° | 43.79 | kJ/mol | N/A | Majer and Svoboda, 1985 | |
ΔvapH° | 43.8 ± 0.2 | kJ/mol | V | Good, 1972 | ALS |
ΔvapH° | 43.8 | kJ/mol | N/A | Good, 1972 | DRB |
ΔvapH° | 45.61 ± 0.92 | kJ/mol | V | Mackle and Mayrick, 1962 | Reanalyzed by Cox and Pilcher, 1970, Original value = 45. ± 1. kJ/mol; ALS |
ΔvapH° | 45.7 | kJ/mol | N/A | Mackle and Mayrick, 1962 | DRB |
Enthalpy of vaporization
ΔvapH (kJ/mol) | Temperature (K) | Reference |
---|---|---|
33.26 | 422.2 | Majer and Svoboda, 1985 |

Gas phase ion energetics data

Data evaluated as indicated in comments:
HL - Edward P. Hunter and Sharon G. Lias
Data compiled as indicated in comments:
LLK - Sharon G. Lias, Rhoda D. Levin, and Sherif A. Kafafi
Quantity | Value | Units | Method | Reference | Comment |
---|---|---|---|---|---|
Proton affinity (review) | 893.8 | kJ/mol | N/A | Hunter and Lias, 1998 | HL |
Quantity | Value | Units | Method | Reference | Comment |
Gas basicity | 864.0 | kJ/mol | N/A | Hunter and Lias, 1998 | HL |
Ionization energy determinations
IE (eV) | Method | Reference | Comment |
---|---|---|---|
8.2 ± 0.1 | EI | Distefano, Ricci, et al., 1974 | LLK |
8.07 | PE | Wagner and Bock, 1974 | Vertical value; LLK |
8.18 ± 0.05 | PE | Distefano, Ricci, et al., 1974, 2 | Vertical value; LLK |
8.07 | PE | Bock, Wagner, et al., 1972 | Vertical value; LLK |

Gas phase thermochemistry data

Data compiled by: Hussein Y. Afeefy, Joel F. Liebman, and Stephen E. Stein
Quantity | Value | Units | Method | Reference | Comment |
---|---|---|---|---|---|
ΔfH°gas | -188.5 ± 1.1 | kJ/mol | Ccr | Good, 1972 | |
ΔfH°gas | -187.0 ± 2.7 | kJ/mol | Ccb | Mackle and Mayrick, 1962 | Reanalyzed by Cox and Pilcher, 1970, Original value = -208. ± 2. kJ/mol |

Normal alkane RI, non-polar column, custom temperature program

Data compiled by: NIST Mass Spectrometry Data Center, William E. Wallace, director

Column type CapillaryPackedCapillary
Active phase Apiezon MApiezon MCP Sil 5 CB
Column length (m)   50.
Carrier gas   He
Substrate
Column diameter (mm)   0.32
Phase thickness (μm)   1.2
Program not specifiednot specified33C (16.5min) => 2C/min => 160C => 20C/min => 200C (9min)
I 918.918.905.
ReferenceLiu, Cao, et al., 2005Yu and Yang, 2005Gijs, Piraprez, et al., 2000
Comment MSDC-RI MSDC-RI MSDC-RI

References

Good, 1972
Good, W.D.,
Enthalpies of combustion of 18 organic sulfur compounds related to petroleum,
J. Chem. Eng. Data, 1972, 17, 158-162. [all data]
Mackle and Mayrick, 1962
Mackle, H.; Mayrick, R.G.,
Studies in the thermochemistry of organic sulphides. Part 2. The gas-phase heats of formation of ten aliphatic sulphides,
Trans. Faraday Soc., 1962, 58, 230-237. [all data]
Cox and Pilcher, 1970
Cox, J.D.; Pilcher, G.,
Thermochemistry of Organic and Organometallic Compounds, Academic Press, New York, 1970, 1-636. [all data]
Weast and Grasselli, 1989
CRC Handbook of Data on Organic Compounds, 2nd Editon, Weast,R.C and Grasselli, J.G., ed(s)., CRC Press, Inc., Boca Raton, FL, 1989, 1. [all data]
Majer and Svoboda, 1985
Majer, V.; Svoboda, V.,
Enthalpies of Vaporization of Organic Compounds: A Critical Review and Data Compilation, Blackwell Scientific Publications, Oxford, 1985, 300. [all data]
Hunter and Lias, 1998
Hunter, E.P.; Lias, S.G.,
Evaluated Gas Phase Basicities and Proton Affinities of Molecules: An Update,
J. Phys. Chem. Ref. Data, 1998, 27, 3, 413-656, https://doi.org/10.1063/1.556018
. [all data]
Distefano, Ricci, et al., 1974
Distefano, G.; Ricci, A.; Danieli, R.; Foffani, A.; Innorta, G.; Torroni, S.,
Mass spectrometric evidence for p π-d π bonding between sulfur and the Group IVB elements,
J. Organomet. Chem., 1974, 65, 205. [all data]
Wagner and Bock, 1974
Wagner, G.; Bock, H.,
Photoelektronenspektren und molekuleigenschaften, XXVI. Die delokalisation von schwefel-elektronenpaaren in alkylsulfiden und -disulfiden,
Chem. Ber., 1974, 107, 68. [all data]
Distefano, Ricci, et al., 1974, 2
Distefano, G.; Ricci, A.; Colonna, F.P.; Pietropaolo, D.; Pignataro, S.,
Bonding between sulfur and the elements of Group IV studied by UV photoelectron spectroscopy,
J. Organomet. Chem., 1974, 78, 93. [all data]
Bock, Wagner, et al., 1972
Bock, H.; Wagner, G.; Kroner, J.,
Photoelektronenspektren und molekuleigenschaften, XIV. Die delokalisation des schwefel-elektronenpaar in CH3S-substituierten aromaten,
Chem. Ber., 1972, 105, 3850. [all data]