Disiloxane, hexamethyl-
- Formula: C6H18OSi2
- Molecular weight: 162.3775
- IUPAC Standard InChIKey: UQEAIHBTYFGYIE-UHFFFAOYSA-N
- CAS Registry Number: 107-46-0
- Chemical structure:
View 3d structure (requires JavaScript / HTML 5) - Other names: Bis(trimethylsilyl) ether; Bis(trimethylsilyl) oxide; Fluka AG; Hexamethyldisiloxane; ((CH3)3Si)2O; Oxybis(trimethylsilane); Silane, oxybis(trimethyl)-; Dow corning 200/0.65; H7310; HMDSO; Belsil DM 0.65; Disiloxane, 1,1,1,3,3,3-hexamethyl-; KF 96L; NSC 43346; OS 10; SWS-F 221; DC 200 FLUID (Salt/Mix)

Condensed phase thermochemistry data

Data compiled by: Eugene S. Domalski and Elizabeth D. Hearing
Quantity | Value | Units | Method | Reference | Comment |
---|---|---|---|---|---|
S°liquid | 433.8 | J/mol*K | N/A | Dzhafarov and Kuliev, 1986 | |
S°liquid | 433.84 | J/mol*K | N/A | Scott, Messerly, et al., 1961 |
Constant pressure heat capacity of liquid
Cp,liquid (J/mol*K) | Temperature (K) | Reference | Comment |
---|---|---|---|
311.4 | 298.15 | Dzhafarov and Kuliev, 1986 | T = 4 to 300 K. Cp(liq) = 275.5 - 34.48x10-2T + 21.7x10-1T2 (204 to 375 K). |
311.37 | 298.15 | Scott, Messerly, et al., 1961 | T = 12 to 371 K. |

Phase change data

Data compiled as indicated in comments:
BS - Robert L. Brown and Stephen E. Stein
TRC - Thermodynamics Research Center, NIST Boulder Laboratories, Chris Muzny director
AC - William E. Acree, Jr., James S. Chickos
DH - Eugene S. Domalski and Elizabeth D. Hearing
Quantity | Value | Units | Method | Reference | Comment |
---|---|---|---|---|---|
Tboil | 373. ± 2. | K | AVG | N/A | Average of 7 values; Individual data points |
Quantity | Value | Units | Method | Reference | Comment |
Ttriple | 204.93 | K | N/A | Scott, Messerly, et al., 1961, 2 | Uncertainty assigned by TRC = 0.02 K; TRC |
Quantity | Value | Units | Method | Reference | Comment |
Tc | 518.7 | K | N/A | McLure and Dickinson, 1976 | Uncertainty assigned by TRC = 0.51 K; TRC |
Quantity | Value | Units | Method | Reference | Comment |
Pc | 19.25 | bar | N/A | McLure and Dickinson, 1976 | Uncertainty assigned by TRC = 0.10 bar; for sample see E.Dickinson and I.A.McClure, 1974-234; TRC |
Enthalpy of vaporization
ΔvapH (kJ/mol) | Temperature (K) | Method | Reference | Comment |
---|---|---|---|---|
36.9 | 315. | EB | Flaningam, 1986 | Based on data from 300. to 383. K.; AC |
33.1 | 327. | N/A | Ditsent, Skorokhodov, et al., 1971 | Based on data from 293. to 361. K.; AC |
36. | 324. | EB | Scott, Messerly, et al., 1961 | Based on data from 309. to 411. K.; AC |
34.6 ± 0.1 | 332. | C | Scott, Messerly, et al., 1961 | AC |
33.1 ± 0.1 | 351. | C | Scott, Messerly, et al., 1961 | AC |
31.3 ± 0.1 | 373. | C | Scott, Messerly, et al., 1961 | AC |
Antoine Equation Parameters
log10(P) = A − (B / (T + C))
P = vapor pressure (bar)
T = temperature (K)
View plot Requires a JavaScript / HTML 5 canvas capable browser.
Temperature (K) | A | B | C | Reference | Comment |
---|---|---|---|---|---|
309.4 to 411.56 | 3.90199 | 1203.916 | -64.673 | Scott, Messerly, et al., 1961 | Coefficents calculated by NIST from author's data. |
Enthalpy of fusion
ΔfusH (kJ/mol) | Temperature (K) | Reference | Comment |
---|---|---|---|
11.920 | 204.93 | Dzhafarov and Kuliev, 1986 | DH |
11.9219 | 204.93 | Scott, Messerly, et al., 1961 | DH |
11.92 | 204.9 | Domalski and Hearing, 1996 | AC |
Entropy of fusion
ΔfusS (J/mol*K) | Temperature (K) | Reference | Comment |
---|---|---|---|
58.18 | 204.93 | Scott, Messerly, et al., 1961 | DH |

Gas phase ion energetics data

Data evaluated as indicated in comments:
HL - Edward P. Hunter and Sharon G. Lias
Data compiled as indicated in comments:
LBLHLM - Sharon G. Lias, John E. Bartmess, Joel F. Liebman, John L. Holmes, Rhoda D. Levin, and W. Gary Mallard
LLK - Sharon G. Lias, Rhoda D. Levin, and Sherif A. Kafafi
RDSH - Henry M. Rosenstock, Keith Draxl, Bruce W. Steiner, and John T. Herron
Quantity | Value | Units | Method | Reference | Comment |
---|---|---|---|---|---|
Proton affinity (review) | 846.4 | kJ/mol | N/A | Hunter and Lias, 1998 | HL |
Quantity | Value | Units | Method | Reference | Comment |
Gas basicity | 816.2 | kJ/mol | N/A | Hunter and Lias, 1998 | HL |
Ionization energy determinations
IE (eV) | Method | Reference | Comment |
---|---|---|---|
9.6 ± 1.0 | EI | Seefeldt, Moller, et al., 1985 | LBLHLM |
9.64 ± 0.01 | PI | Molder, Pikver, et al., 1983 | LBLHLM |
9.59 ± 0.04 | EI | Hess, Lampe, et al., 1965 | RDSH |
9.88 | PE | Starzewski, Dieck, et al., 1974 | Vertical value; LLK |
Appearance energy determinations
Ion | AE (eV) | Other Products | Method | Reference | Comment |
---|---|---|---|---|---|
C3H9SiO+ | 21.8 ± 0.2 | ? | EI | Borossay, Csakvari, et al., 1971 | LLK |
C3H9Si+ | 15.4 ± 0.2 | ? | EI | Borossay, Csakvari, et al., 1971 | LLK |
C3H9Si+ | 15.36 ± 0.13 | ? | EI | Hess, Lampe, et al., 1965 | RDSH |
C5H15OSi2+ | 10.4 ± 0.2 | CH3 | EI | Seefeldt, Moller, et al., 1985 | LBLHLM |
C5H15OSi2+ | 10.20 ± 0.07 | CH3 | EI | Hess, Lampe, et al., 1965 | RDSH |

Kovats' RI, non-polar column, isothermal

View large format table.

Column type Active phase Temperature (C) I Reference Comment
PackedC78, Branched paraffin130.597.4Dallos, Sisak, et al., 2000He; Column length: 3.3 m
PackedC78, Branched paraffin130.597.4Reddy, Dutoit, et al., 1992Chromosorb G HP; Column length: 3.3 m
PackedApolane130.598.Dutoit, 1991Column length: 3.7 m

Normal alkane RI, non-polar column, temperature ramp

View large format table.

Column type Active phase I Reference Comment
CapillarySqualane645.Szekely, Nefedov, et al., 1967Nitrogen, 5. K/min; Column length: 50. m; Column diameter: 0.25 mm; Tstart: 60. C; Tend: 250. C

Normal alkane RI, non-polar column, custom temperature program

View large format table.

Column type Active phase I Reference Comment
CapillarySqualane646.Szekely, Nefedov, et al., 1967Nitrogen; Column length: 50. m; Column diameter: 0.25 mm; Program: not specified

References

Dzhafarov and Kuliev, 1986
Dzhafarov, O.I.; Kuliev, A.M.,
Heat capacity and thermodynamic properties of disiloxanes,
Dokl. Akad. Nauk. Azerb., 1986, SSR 42, 56-59. [all data]
Scott, Messerly, et al., 1961
Scott, D.W.; Messerly, J.F.; Todd, S.S.; Guthrie, G.B.; Hossenlopp, I.A.; Moore, R.T.; Osborn, A.; Berg, W.T.; McCullough, J.P.,
Hexamethyldisiloxane: chemical thermodynamic properties and internal rotation about the siloxane linkage,
J. Phys. Chem., 1961, 65, 1320-1326. [all data]
Scott, Messerly, et al., 1961, 2
Scott, D.W.; Messerly, J.F.; Todd, S.S.; Guthrie, G.B.; Hossenlopp, I.A.; Moore, R.T.; Osborn, A.G.; Berg, W.T.; McCullough, J.P.,
Hexamethyldisiloxane: chemical thermodynamic properties and internal rotation about the siloxane linkage,
J. Phys. Chem., 1961, 65, 1320-6. [all data]
McLure and Dickinson, 1976
McLure, I.A.; Dickinson, E.,
Vapor pressure of hexamethyldisiloxane near its critical point: corresponding-states principle for dimethylsiloxanes,
J. Chem. Thermodyn., 1976, 8, 93-5. [all data]
Flaningam, 1986
Flaningam, Ora L.,
Vapor pressures of poly(dimethylsiloxane) oligomers,
J. Chem. Eng. Data, 1986, 31, 3, 266-272, https://doi.org/10.1021/je00045a002
. [all data]
Ditsent, Skorokhodov, et al., 1971
Ditsent, V.E.; Skorokhodov, I.I.; Terent'eva, N.A.; Zolotareva, M.N.,
Russ. J. Phys. Chem., 1971, 45, 6, 901. [all data]
Domalski and Hearing, 1996
Domalski, Eugene S.; Hearing, Elizabeth D.,
Heat Capacities and Entropies of Organic Compounds in the Condensed Phase. Volume III,
J. Phys. Chem. Ref. Data, 1996, 25, 1, 1, https://doi.org/10.1063/1.555985
. [all data]
Hunter and Lias, 1998
Hunter, E.P.; Lias, S.G.,
Evaluated Gas Phase Basicities and Proton Affinities of Molecules: An Update,
J. Phys. Chem. Ref. Data, 1998, 27, 3, 413-656, https://doi.org/10.1063/1.556018
. [all data]
Seefeldt, Moller, et al., 1985
Seefeldt, R.; Moller, W.; Schmidt, M.,
Zur elektronenstossionisierung des hexamethyldisiloxans (HMDS),
Z. Phys. Chem. (Leipzig), 1985, 266, 797. [all data]
Molder, Pikver, et al., 1983
Molder, U.H.; Pikver, R.J.; Koppel, I.A.,
Photoelectron spectra of molecules. 2. Ethers,
Org. React. (N.Y. Engl. Transl.), 1983, 20, 208. [all data]
Hess, Lampe, et al., 1965
Hess, G.G.; Lampe, F.W.; Sommer, L.H.,
An electron impact study of ionization and dissociation of trimethylsilanes,
J. Am. Chem. Soc., 1965, 87, 5327. [all data]
Starzewski, Dieck, et al., 1974
Starzewski, K.A.O.; Dieck, H.T.; Bock, H.,
Photoelectron spectra molecular properties. XXIII. Photoelectron spectra of silicon-substituted ylidic systems,
J. Organomet. Chem., 1974, 65, 311. [all data]
Borossay, Csakvari, et al., 1971
Borossay, J.; Csakvari, B.; Szepes, L.,
Determination of bond energies of organic silicon compounds on the basis of appearance potentials,
Int. J. Mass Spectrom. Ion Phys., 1971, 7, 47. [all data]