Cyclooctanone, oxime
- Formula: C8H15NO
- Molecular weight: 141.2108
- IUPAC Standard InChIKey: KTPUHSVFNHULJH-UHFFFAOYSA-N
- CAS Registry Number: 1074-51-7
- Chemical structure:
View 3d structure (requires JavaScript / HTML 5) - Permanent link for this species. Use this link for bookmarking this species for future reference.

Gas phase ion energetics data

Data compiled as indicated in comments:
LLK - Sharon G. Lias, Rhoda D. Levin, and Sherif A. Kafafi
Ionization energy determinations
IE (eV) | Method | Reference | Comment |
---|---|---|---|
8.80 ± 0.03 | PI | Golubitskii, Kulikov, et al., 1979 | LLK |
Appearance energy determinations
Ion | AE (eV) | Other Products | Method | Reference | Comment |
---|---|---|---|---|---|
C5H9NO+ | 9.26 ± 0.05 | C3H6 | PI | Golubitskii, Kulikov, et al., 1979 | LLK |
C6H11NO+ | 9.04 ± 0.05 | C2H4 | PI | Golubitskii, Kulikov, et al., 1979 | LLK |
C8H13+ | 9.68 ± 0.05 | NHOH | PI | Golubitskii, Kulikov, et al., 1979 | LLK |

References

Golubitskii, Kulikov, et al., 1979
Golubitskii, A.E.; Kulikov, N.S.; Zyakun, A.M.; Valovoi, V.A.; Alekseev, A.M.; Volkov, V.N.,
Photoionization mass spectra of alicyclic compounds with various substituents, and their ionization energies and appearance energies,
Bull. Acad. Sci. USSR, Div. Chem. Sci., 1979, 11, 2602. [all data]