Hexylene glycol
- Formula: C6H14O2
- Molecular weight: 118.1742
- IUPAC Standard InChIKey: SVTBMSDMJJWYQN-YFKPBYRVSA-N
- CAS Registry Number: 107-41-5
- Chemical structure:
View 3d structure (requires JavaScript / HTML 5) - Other names: 2,4-Pentanediol, 2-methyl-; α,α,α'-Trimethyltrimethylene glycol; Diolane; Isol; 1,1,3-Trimethyltrimethylenediol; 2-Methyl-2,4-pentandiol; 2-Methyl-2,4-pentanediol; 2,4-Dihydroxy-2-methylpentane; 4-Methyl-2,4-pentanediol; 2-Methyl pentane-2,4-diol; 2-Methylpentan-2,4-diol; Pinakon; 4-Methyl-2,4-pentanediole; (.+/-.)-2-Methyl-2,4-pentanediol; NSC 8098; Isophthalic acid

Phase change data

Data compiled as indicated in comments:
BS - Robert L. Brown and Stephen E. Stein
TRC - Thermodynamics Research Center, NIST Boulder Laboratories, Chris Muzny director
AC - William E. Acree, Jr., James S. Chickos
Quantity | Value | Units | Method | Reference | Comment |
---|---|---|---|---|---|
Tboil | 471.2 | K | N/A | Weast and Grasselli, 1989 | BS |
Tboil | 470.25 | K | N/A | Mellan, 1962 | Uncertainty assigned by TRC = 1. K; TRC |
Tboil | 471.42 | K | N/A | Mellan, 1962 | Uncertainty assigned by TRC = 0.5 K; TRC |
Tboil | 469.15 | K | N/A | Stephenson and Van Winkle, 1962 | Uncertainty assigned by TRC = 1. K; TRC |
Quantity | Value | Units | Method | Reference | Comment |
ΔvapH° | 68.9 ± 0.4 | kJ/mol | GS | Verevkin, 2007 | Based on data from 285. to 329. K.; AC |
ΔvapH° | 68.6 ± 0.4 | kJ/mol | EB | Daubert and Hutchison, 1990 | Based on data from 370. to 547. K. See also Verevkin, 2007.; AC |
Enthalpy of vaporization
ΔvapH (kJ/mol) | Temperature (K) | Method | Reference | Comment |
---|---|---|---|---|
58.1 | 388. | A | Stephenson and Malanowski, 1987 | Based on data from 373. to 473. K.; AC |

Gas phase ion energetics data

Data compiled by: Sharon G. Lias and Joel F. Liebman
Appearance energy determinations
Ion | AE (eV) | Other Products | Method | Reference | Comment |
---|---|---|---|---|---|
C3H7O+ | 9.60 | C3H7O | EI | Holmes, Lossing, et al., 1991 |

Kovats' RI, non-polar column, isothermal

Column type | Active phase | Temperature (C) | I | Reference | Comment |
---|---|---|---|---|---|
Packed | Apiezon L | 160. | 892. | Bogoslovsky, Anvaer, et al., 1978 | Celite 545 |

Normal alkane RI, non-polar column, temperature ramp

Column type | Active phase | I | Reference | Comment |
---|---|---|---|---|
Capillary | SPB-1 | 913. | Vijayanand, Rao, et al., 2001 | 30. m/0.32 mm/0.25 μm, He, 2. K/min; Tstart: 50. C; Tend: 250. C |

Normal alkane RI, non-polar column, custom temperature program

Column type | Active phase | I | Reference | Comment |
---|---|---|---|---|
Capillary | DB-1 | 898. | Ciccioli, Cecinato, et al., 1994 | 60. m/0.32 mm/0.25 μm; Program: not specified |
Capillary | DB-1 | 898. | Ciccioli, Brancaleoni, et al., 1993 | 60. m/0.32 mm/0.25 μm; Program: 3 min at 5 C; 5 - 50 C at 3 deg/min; 50 - 220 C at 5 deg/min |

Normal alkane RI, polar column, custom temperature program

Column type | Active phase | I | Reference | Comment |
---|---|---|---|---|
Capillary | DB-Wax | 1637. | Mattheis, Buchanan, et al., 1992 | 60. m/0.25 mm/0.25 μm, He; Program: 35C (5min) => 2C/min => 50C => 5C/min => 200C(5min) |
Capillary | DB-Wax | 1637. | Mattheis, Buchanan, et al., 1992 | 60. m/0.25 mm/0.25 μm, He; Program: 35C (5min) => 2C/min => 50C => 5C/min => 200C(5min) |

Henry's Law data

Data compiled by: Rolf Sander
Henry's Law constant (water solution)
kH(T) = k°H exp(d(ln(kH))/d(1/T) ((1/T) - 1/(298.15 K)))
k°H = Henry's law constant for solubility in water at 298.15 K (mol/(kg*bar))
d(ln(kH))/d(1/T) = Temperature dependence constant (K)
k°H (mol/(kg*bar)) | d(ln(kH))/d(1/T) (K) | Method | Reference | Comment |
---|---|---|---|---|
2.0×10+6 | E | N/A | Value obtained by missing citation using the group contribution method. |

References

Weast and Grasselli, 1989
CRC Handbook of Data on Organic Compounds, 2nd Editon, Weast,R.C and Grasselli, J.G., ed(s)., CRC Press, Inc., Boca Raton, FL, 1989, 1. [all data]
Mellan, 1962
Mellan, I.,
Polyhydric Alcohols, Spartan Books: Washington, DC, 1962. [all data]
Stephenson and Van Winkle, 1962
Stephenson, R.W.; Van Winkle, M.,
Modification of Relative Volatilities by Addition of Solvent,
J. Chem. Eng. Data, 1962, 7, 510. [all data]
Verevkin, 2007
Verevkin, Sergey P.,
Vapor Pressures and Enthalpies of Vaporization of a Series of the 1,3-Alkanediols,
J. Chem. Eng. Data, 2007, 52, 1, 301-308, https://doi.org/10.1021/je060419q
. [all data]
Daubert and Hutchison, 1990
Daubert, T.E.; Hutchison, G.,
Vapor pressure of 18 pure industrial chemicals,
AIChE Symp. Ser., 1990, 86, 279, 93. [all data]
Stephenson and Malanowski, 1987
Stephenson, Richard M.; Malanowski, Stanislaw,
Handbook of the Thermodynamics of Organic Compounds, 1987, https://doi.org/10.1007/978-94-009-3173-2
. [all data]
Holmes, Lossing, et al., 1991
Holmes, J.L.; Lossing, F.P.; Mayer, P.M.,
Heats of formation of oxygen-containing organic free radicals from appearance energy measurements,
J. Am. Chem. Soc., 1991, 113, 9723. [all data]