Methyl formate
- Formula: C2H4O2
- Molecular weight: 60.0520
- IUPAC Standard InChIKey: TZIHFWKZFHZASV-UHFFFAOYSA-N
- CAS Registry Number: 107-31-3
- Chemical structure:
View 3d structure (requires JavaScript / HTML 5) - Other names: Formic acid, methyl ester; Methyl methanoate; HCOOCH3; Formiate de methyle; Methylester kyseliny mravenci; Methylformiaat; Methylformiat; Mravencan methylnaty; UN 1243; Methyl ester of formic acid; Methanoic acid methyl ester

Phase change data

Data compiled as indicated in comments:
BS - Robert L. Brown and Stephen E. Stein
TRC - Thermodynamics Research Center, NIST Boulder Laboratories, Chris Muzny director
ALS - Hussein Y. Afeefy, Joel F. Liebman, and Stephen E. Stein
DRB - Donald R. Burgess, Jr.
AC - William E. Acree, Jr., James S. Chickos
Quantity | Value | Units | Method | Reference | Comment |
---|---|---|---|---|---|
Tboil | 305. ± 1. | K | AVG | N/A | Average of 20 values; Individual data points |
Quantity | Value | Units | Method | Reference | Comment |
Tfus | 173.2 | K | N/A | Timmermans, 1935 | Uncertainty assigned by TRC = 2. K; TRC |
Tfus | 173.4 | K | N/A | Timmermans, 1911 | Uncertainty assigned by TRC = 0.3 K; TRC |
Quantity | Value | Units | Method | Reference | Comment |
Tc | 487.2 | K | N/A | Majer and Svoboda, 1985 | |
Tc | 487.2 | K | N/A | Young, 1910 | Uncertainty assigned by TRC = 1. K; TRC |
Tc | 487.2 | K | N/A | Young and Thomas, 1893 | Uncertainty assigned by TRC = 1. K; TRC |
Tc | 523.7 | K | N/A | De Heen, 1888 | Uncertainty assigned by TRC = 20. K; TRC |
Tc | 485.2 | K | N/A | Nadezhdin, 1887 | Uncertainty assigned by TRC = 2. K; TRC |
Quantity | Value | Units | Method | Reference | Comment |
Pc | 60.04 | bar | N/A | Young, 1910 | Uncertainty assigned by TRC = 0.6079 bar; TRC |
Pc | 60.075 | bar | N/A | Young and Thomas, 1893 | Uncertainty assigned by TRC = 0.40 bar; TRC |
Pc | 62.47 | bar | N/A | Nadezhdin, 1887 | Uncertainty assigned by TRC = 2.0265 bar; TRC |
Quantity | Value | Units | Method | Reference | Comment |
ρc | 5.818 | mol/l | N/A | Young, 1910 | Uncertainty assigned by TRC = 0.08 mol/l; TRC |
ρc | 5.818 | mol/l | N/A | Young and Thomas, 1893 | Uncertainty assigned by TRC = 0.07 mol/l; TRC |
Quantity | Value | Units | Method | Reference | Comment |
ΔvapH° | 29. ± 2. | kJ/mol | AVG | N/A | Average of 6 values; Individual data points |
Enthalpy of vaporization
ΔvapH (kJ/mol) | Temperature (K) | Method | Reference | Comment |
---|---|---|---|---|
27.92 | 304.7 | N/A | Majer and Svoboda, 1985 | |
29.6 | 292. | A | Stephenson and Malanowski, 1987 | Based on data from 279. to 305. K.; AC |
28.4 | 320. | A | Stephenson and Malanowski, 1987 | Based on data from 305. to 443. K.; AC |
28.7 ± 0.1 | 293. | C | Cihlár, Hynek, et al., 1976 | AC |
27.9 ± 0.1 | 305. | C | Cihlár, Hynek, et al., 1976 | AC |
27.4 ± 0.1 | 313. | C | Cihlár, Hynek, et al., 1976 | AC |
30.1 | 283. | BG | Baldt and Hall, 1971 | Based on data from 261. to 305. K.; AC |
Enthalpy of vaporization
ΔvapH =
A exp(-βTr) (1 − Tr)β
ΔvapH =
Enthalpy of vaporization (at saturation pressure)
(kJ/mol)
Tr = reduced temperature (T / Tc)
View plot Requires a JavaScript / HTML 5 canvas capable browser.
Temperature (K) | A (kJ/mol) | β | Tc (K) | Reference | Comment |
---|---|---|---|---|---|
293. to 314. | 46.09 | 0.3119 | 487.2 | Majer and Svoboda, 1985 |
Antoine Equation Parameters
log10(P) = A − (B / (T + C))
P = vapor pressure (bar)
T = temperature (K)
View plot Requires a JavaScript / HTML 5 canvas capable browser.
Temperature (K) | A | B | C | Reference | Comment |
---|---|---|---|---|---|
294. to 304.9 | 0.25097 | 6.524 | -278.54 | Nelson, 1928 | Coefficents calculated by NIST from author's data. |

Gas phase ion energetics data

Data evaluated as indicated in comments:
HL - Edward P. Hunter and Sharon G. Lias
L - Sharon G. Lias
Data compiled as indicated in comments:
B - John E. Bartmess
LL - Sharon G. Lias and Joel F. Liebman
LBLHLM - Sharon G. Lias, John E. Bartmess, Joel F. Liebman, John L. Holmes, Rhoda D. Levin, and W. Gary Mallard
LLK - Sharon G. Lias, Rhoda D. Levin, and Sherif A. Kafafi
RDSH - Henry M. Rosenstock, Keith Draxl, Bruce W. Steiner, and John T. Herron
Quantity | Value | Units | Method | Reference | Comment |
---|---|---|---|---|---|
IE (evaluated) | 10.835 | eV | N/A | N/A | L |
Quantity | Value | Units | Method | Reference | Comment |
Proton affinity (review) | 782.5 | kJ/mol | N/A | Hunter and Lias, 1998 | HL |
Quantity | Value | Units | Method | Reference | Comment |
Gas basicity | 751.5 | kJ/mol | N/A | Hunter and Lias, 1998 | HL |
Ionization energy determinations
IE (eV) | Method | Reference | Comment |
---|---|---|---|
10.835 | TE | Waterstradt, Jung, et al., 1994 | LL |
~10.7 | PE | Cannington and Ham, 1985 | LBLHLM |
10.99 | PE | Kimura, Katsumata, et al., 1981 | LLK |
10.85 ± 0.05 | PE | Benoit, Harrison, et al., 1977 | LLK |
10.85 | PE | Sweigart and Turner, 1972 | LLK |
10.815 ± 0.005 | PI | Watanabe, Nakayama, et al., 1962 | RDSH |
11.0 | PE | Cannington and Ham, 1985 | Vertical value; LBLHLM |
10.85 | PE | Benoit and Harrison, 1977 | Vertical value; LLK |
10.3 | PE | Rao, 1975 | Vertical value; LLK |
Appearance energy determinations
Ion | AE (eV) | Other Products | Method | Reference | Comment |
---|---|---|---|---|---|
CHO+ | 12.91 ± 0.07 | CH3O | PIPECO | Nishimura, Zha, et al., 1987 | LBLHLM |
CHO+ | 13.47 ± 0.05 | CH3O | EI | Haney and Franklin, 1969 | RDSH |
CHO2+ | 15.9 | CH3 | EI | King and Long, 1958 | RDSH |
CH2+ | 19.8 | ? | EI | King and Long, 1958 | RDSH |
CH2O+ | 13.6 | ? | EI | King and Long, 1958 | RDSH |
CH3+ | 13.27 ± 0.24 | HCO2 | PIPECO | Nishimura, Zha, et al., 1987 | LBLHLM |
CH3+ | 13.71 | ? | EI | Haney and Franklin, 1969 | RDSH |
CH3O+ | 12.23 | CHO | EI | Haney and Franklin, 1969 | RDSH |
CH4O+ | 11.47 ± 0.05 | CO | PIPECO | Nishimura, Zha, et al., 1987 | LBLHLM |
CH4O+ | 11.5 ± 0.1 | CO | EI | VanRaalte and Harrison, 1963 | RDSH |
C2H3O2+ | 12.3 | H | EI | King and Long, 1958 | RDSH |
De-protonation reactions
C2H3O2- + =
By formula: C2H3O2- + H+ = C2H4O2
Quantity | Value | Units | Method | Reference | Comment |
---|---|---|---|---|---|
ΔrH° | <1606.7 | kJ/mol | CIDT | Graul and Squires, 1988 | gas phase; B |
ΔrH° | <1639.1 ± 3.8 | kJ/mol | G+TS | DePuy, Grabowski, et al., 1985 | gas phase; HO- + DCO2CH3 -> (M-D)-. ΔHf(MeO- + CO) = -59.7 kcal/mol; B |
Quantity | Value | Units | Method | Reference | Comment |
ΔrG° | <1606.7 | kJ/mol | IMRB | DePuy, Grabowski, et al., 1985 | gas phase; HO- + DCO2CH3 -> (M-D)-. ΔHf(MeO- + CO) = -59.7 kcal/mol; B |
C2H3O2- + =
By formula: C2H3O2- + H+ = C2H4O2
Quantity | Value | Units | Method | Reference | Comment |
---|---|---|---|---|---|
ΔrH° | 1637. ± 17. | kJ/mol | G+TS | DePuy, Grabowski, et al., 1985 | gas phase; B |
Quantity | Value | Units | Method | Reference | Comment |
ΔrG° | 1607. ± 17. | kJ/mol | IMRB | DePuy, Grabowski, et al., 1985 | gas phase; B |

Gas phase thermochemistry data

Data compiled as indicated in comments:
DRB - Donald R. Burgess, Jr.
ALS - Hussein Y. Afeefy, Joel F. Liebman, and Stephen E. Stein
GT - Glushko Thermocenter, Russian Academy of Sciences, Moscow
Quantity | Value | Units | Method | Reference | Comment |
---|---|---|---|---|---|
ΔfH°gas | -80.52 | kcal/mol | N/A | Gladii, Starchevskii, et al., 1990 | Value computed using ΔfHliquid° value of -365.9 kj/mol from Gladii, Starchevskii, et al., 1990 and ΔvapH° value of 29.0 kj/mol from Hine and Klueppet, 1974.; DRB |
ΔfH°gas | -83.41 | kcal/mol | N/A | Guthrie, 1974 | Value computed using ΔfHliquid° value of -378.0 kj/mol from Guthrie, 1974 and ΔvapH° value of 29.0 kj/mol from Hine and Klueppet, 1974.; DRB |
ΔfH°gas | -86.6 | kcal/mol | Cm | Hine and Klueppet, 1974 | ALS |
ΔfH°gas | -84.97 | kcal/mol | Ccr | Hall and Baldt, 1971 | ALS |
Constant pressure heat capacity of gas
Cp,gas (cal/mol*K) | Temperature (K) | Reference | Comment |
---|---|---|---|
10.53 | 100. | Chao J., 1986 | p=1 bar. Recommended S(T) and Cp(T) values are in close agreement with statistical values calculated by [ Vay P.-M., 1971] (discrepancies in S(T) do not exceed 1.3 J/mol*K) and value of S(298.15 K)=286.10 J/mol*K determined from high accuracy ab initio calculation [ East A.L.L., 1997].; GT |
11.91 | 150. | ||
12.95 | 200. | ||
14.69 | 273.15 | ||
15.39 ± 0.02 | 298.15 | ||
15.44 | 300. | ||
18.54 | 400. | ||
21.58 | 500. | ||
24.276 | 600. | ||
26.592 | 700. | ||
28.568 | 800. | ||
30.261 | 900. | ||
31.711 | 1000. | ||
32.957 | 1100. | ||
34.030 | 1200. | ||
34.952 | 1300. | ||
35.750 | 1400. | ||
36.444 | 1500. |

Condensed phase thermochemistry data

Data compiled as indicated in comments:
ALS - Hussein Y. Afeefy, Joel F. Liebman, and Stephen E. Stein
DH - Eugene S. Domalski and Elizabeth D. Hearing
Quantity | Value | Units | Method | Reference | Comment |
---|---|---|---|---|---|
ΔfH°liquid | -87.45 | kcal/mol | Eqk | Gladii, Starchevskii, et al., 1990 | ALS |
ΔfH°liquid | -90.35 | kcal/mol | Cm | Guthrie, 1974 | Heat of hydrolysis; ALS |
ΔfH°liquid | -93.4 | kcal/mol | Cm | Hine and Klueppet, 1974 | ALS |
ΔfH°liquid | -92.28 | kcal/mol | Ccr | Hall and Baldt, 1971 | ALS |
Quantity | Value | Units | Method | Reference | Comment |
ΔcH°liquid | -232.46 ± 0.14 | kcal/mol | Ccr | Hall and Baldt, 1971 | Corresponding ΔfHºliquid = -92.27 kcal/mol (simple calculation by NIST; no Washburn corrections); ALS |
Constant pressure heat capacity of liquid
Cp,liquid (cal/mol*K) | Temperature (K) | Reference | Comment |
---|---|---|---|
28.817 | 298.75 | Zabransky, Hynek, et al., 1987 | T = 293 to 299 K. Unsmoothed experimental datum.; DH |
28.61 | 298.15 | Fuchs, 1979 | DH |
22.8 | 297. | Hall and Baldt, 1971 | DH |
28.99 | 288. | Mehl, 1934 | DH |
31.1 | 298. | Berthelot and Ogier, 1881 | T = 286 to 302 K. Cp given as 0.516 cal/g*K.; DH |

Reaction thermochemistry data

Data compiled as indicated in comments:
B - John E. Bartmess
ALS - Hussein Y. Afeefy, Joel F. Liebman, and Stephen E. Stein
Individual Reactions
C2H3O2- + =
By formula: C2H3O2- + H+ = C2H4O2
Quantity | Value | Units | Method | Reference | Comment |
---|---|---|---|---|---|
ΔrH° | <384.00 | kcal/mol | CIDT | Graul and Squires, 1988 | gas phase; B |
ΔrH° | <391.75 ± 0.90 | kcal/mol | G+TS | DePuy, Grabowski, et al., 1985 | gas phase; HO- + DCO2CH3 -> (M-D)-. ΔHf(MeO- + CO) = -59.7 kcal/mol; B |
Quantity | Value | Units | Method | Reference | Comment |
ΔrG° | <384.00 | kcal/mol | IMRB | DePuy, Grabowski, et al., 1985 | gas phase; HO- + DCO2CH3 -> (M-D)-. ΔHf(MeO- + CO) = -59.7 kcal/mol; B |
C2H3O2- + =
By formula: C2H3O2- + H+ = C2H4O2
Quantity | Value | Units | Method | Reference | Comment |
---|---|---|---|---|---|
ΔrH° | 391.2 ± 4.1 | kcal/mol | G+TS | DePuy, Grabowski, et al., 1985 | gas phase; B |
Quantity | Value | Units | Method | Reference | Comment |
ΔrG° | 384.1 ± 4.0 | kcal/mol | IMRB | DePuy, Grabowski, et al., 1985 | gas phase; B |
By formula: C4H10O3 + H2O = C2H4O2 + 2CH4O
Quantity | Value | Units | Method | Reference | Comment |
---|---|---|---|---|---|
ΔrH° | -2.29 ± 0.28 | kcal/mol | Cm | Hine and Klueppet, 1974 | liquid phase; ALS |

Henry's Law data

Data compiled by: Rolf Sander
Henry's Law constant (water solution)
kH(T) = k°H exp(d(ln(kH))/d(1/T) ((1/T) - 1/(298.15 K)))
k°H = Henry's law constant for solubility in water at 298.15 K (mol/(kg*bar))
d(ln(kH))/d(1/T) = Temperature dependence constant (K)
k°H (mol/(kg*bar)) | d(ln(kH))/d(1/T) (K) | Method | Reference | Comment |
---|---|---|---|---|
4.1 | M | N/A | ||
4.5 | Q | N/A | missing citation is quoted as the source. However, there only activity coefficients and no vapor pressures are listed. | |
4.5 | Q | N/A | missing citation is quoted as the source. However, there only activity coefficients and no vapor pressures are listed. | |
4.1 | 3800. | M | N/A |

References

Timmermans, 1935
Timmermans, J.,
Researches in Stoichiometry. I. The Heat of Fusion of Organic Compounds.,
Bull. Soc. Chim. Belg., 1935, 44, 17-40. [all data]
Timmermans, 1911
Timmermans, J.,
Researches on the freezing point of organic liquid compounds,
Bull. Soc. Chim. Belg., 1911, 25, 300. [all data]
Majer and Svoboda, 1985
Majer, V.; Svoboda, V.,
Enthalpies of Vaporization of Organic Compounds: A Critical Review and Data Compilation, Blackwell Scientific Publications, Oxford, 1985, 300. [all data]
Young, 1910
Young, S.,
The Internal Heat of Vaporization constants of thirty pure substances,
Sci. Proc. R. Dublin Soc., 1910, 12, 374. [all data]
Young and Thomas, 1893
Young, S.; Thomas, G.L.,
The vapour pressures, molecular volumes, and critical constants of ten of the lower esters,
J. Chem. Soc., 1893, 63, 1191. [all data]
De Heen, 1888
De Heen, P.,
Research on Physics and Theory of Liquids, Experimental Part Paris, 1888. [all data]
Nadezhdin, 1887
Nadezhdin, A.,
Rep. Phys., 1887, 23, 708. [all data]
Stephenson and Malanowski, 1987
Stephenson, Richard M.; Malanowski, Stanislaw,
Handbook of the Thermodynamics of Organic Compounds, 1987, https://doi.org/10.1007/978-94-009-3173-2
. [all data]
Cihlár, Hynek, et al., 1976
Cihlár, J.; Hynek, V.; Svoboda, V.; Holub, R.,
Heats of vaporization of alkyl esters of formic acid,
Collect. Czech. Chem. Commun., 1976, 41, 1, 1-6, https://doi.org/10.1135/cccc19760001
. [all data]
Baldt and Hall, 1971
Baldt, J.H.; Hall, H.K.K., Jr.,
Thermochemistry of strained-ring bridgehead nitriles and esters,
J. Am. Chem. Soc., 1971, 93, 140-145. [all data]
Nelson, 1928
Nelson, O.A.,
Vapor Pressures of Fumigants: II---Methyl, Ethyl, n-Propyl, Isopropyl, n-Butyl, Secondary Butyl and Isobutyl Formates 1,
Ind. Eng. Chem., 1928, 20, 12, 1382-1384, https://doi.org/10.1021/ie50228a035
. [all data]
Hunter and Lias, 1998
Hunter, E.P.; Lias, S.G.,
Evaluated Gas Phase Basicities and Proton Affinities of Molecules: An Update,
J. Phys. Chem. Ref. Data, 1998, 27, 3, 413-656, https://doi.org/10.1063/1.556018
. [all data]
Waterstradt, Jung, et al., 1994
Waterstradt, E.; Jung, R.; Belling, T.; Muller-Dethlefs, K.,
Zero kinetic energy (ZEKE) photoelectron spectrum and coincident mass spectra of methyl formate,
Ber. Bunsen-Ges. Phys. Chem., 1994, 98, 176. [all data]
Cannington and Ham, 1985
Cannington, P.H.; Ham, N.S.,
He(II) photoelectron spectra of esters,
J. Electron Spectrosc. Relat. Phenom., 1985, 36, 203. [all data]
Kimura, Katsumata, et al., 1981
Kimura, K.; Katsumata, S.; Achiba, Y.; Yamazaki, T.; Iwata, S.,
Ionization energies, Ab initio assignments, and valence electronic structure for 200 molecules
in Handbook of HeI Photoelectron Spectra of Fundamental Organic Compounds, Japan Scientific Soc. Press, Tokyo, 1981. [all data]
Benoit, Harrison, et al., 1977
Benoit, F.M.; Harrison, A.G.; Lossing, F.P.,
Hydrogen migrations in mass spectrometry III-Energetics of formation of [R'CO2H2]+ in the mass spectra of R'CO2R,
Org. Mass Spectrom., 1977, 12, 78. [all data]
Sweigart and Turner, 1972
Sweigart, D.A.; Turner, D.W.,
Lone pair orbitals and their interactions studied by photoelectron spectroscopy. I. Carboxylic acids and their derivatives,
J. Am. Chem. Soc., 1972, 94, 5592. [all data]
Watanabe, Nakayama, et al., 1962
Watanabe, K.; Nakayama, T.; Mottl, J.,
Ionization potentials of some molecules,
J. Quant. Spectry. Radiative Transfer, 1962, 2, 369. [all data]
Benoit and Harrison, 1977
Benoit, F.M.; Harrison, A.G.,
Predictive value of proton affinity. Ionization energy correlations involving oxygenated molecules,
J. Am. Chem. Soc., 1977, 99, 3980. [all data]
Rao, 1975
Rao, C.N.R.,
Lone-pair ionization bands of chromophores in the photoelectron spectra of organic molecules,
Indian J. Chem., 1975, 13, 950. [all data]
Nishimura, Zha, et al., 1987
Nishimura, T.; Zha, Q.; Meisels, G.G.,
Unimolecular dissociation of energy-selected methyl formate ion,
J. Chem. Phys., 1987, 87, 4589. [all data]
Haney and Franklin, 1969
Haney, M.A.; Franklin, J.L.,
Excess energies in mass spectra of some oxygen-containing organic compounds,
J. Chem. Soc. Faraday Trans., 1969, 65, 1794. [all data]
King and Long, 1958
King, A.B.; Long, F.A.,
Mass spectra of some simple esters and their interpretation by quasi-equilibrium theory,
J. Chem. Phys., 1958, 29, 374. [all data]
VanRaalte and Harrison, 1963
VanRaalte, D.; Harrison, A.G.,
Ionization and dissociation of formate esters by electron impact,
Can. J. Chem., 1963, 41, 2054. [all data]
Graul and Squires, 1988
Graul, S.T.; Squires, R.R.,
On the Existence of Alkyl Carbanions in the Gas Phase,
J. Am. Chem. Soc., 1988, 110, 2, 607, https://doi.org/10.1021/ja00210a054
. [all data]
DePuy, Grabowski, et al., 1985
DePuy, C.H.; Grabowski, J.J.; Bierbaum, V.M.; Ingemann, S.; Nibbering, N.M.M.,
Gas-phase reactions of anions with methyl formate and N,N-dimethylformamide,
J. Am. Chem. Soc., 1985, 107, 1093. [all data]