1,4-Cyclooctadiene
- Formula: C8H12
- Molecular weight: 108.1809
- IUPAC Standard InChIKey: DNZZPKYSGRTNGK-ACALLGSNSA-N
- CAS Registry Number: 1073-07-0
- Chemical structure:
View 3d structure (requires JavaScript / HTML 5) - Stereoisomers:
- Other names: Cycloocta-1,4-diene

Phase change data

Data compiled by: Thermodynamics Research Center, NIST Boulder Laboratories, Chris Muzny director
Quantity | Value | Units | Method | Reference | Comment |
---|---|---|---|---|---|
Tfus | 220. | K | N/A | Ziegler and Wilms, 1950 | Uncertainty assigned by TRC = 4. K |

Reaction thermochemistry data

Data compiled by: Hussein Y. Afeefy, Joel F. Liebman, and Stephen E. Stein
Individual Reactions
By formula: C8H12 + 2H2 = C8H16
Quantity | Value | Units | Method | Reference | Comment |
---|---|---|---|---|---|
ΔrH° | -217.9 ± 1.2 | kJ/mol | Chyd | Turner, Mallon, et al., 1973 | liquid phase; solvent: Glacial acetic acid |

Gas phase ion energetics data

Data compiled as indicated in comments:
LLK - Sharon G. Lias, Rhoda D. Levin, and Sherif A. Kafafi
RDSH - Henry M. Rosenstock, Keith Draxl, Bruce W. Steiner, and John T. Herron
Ionization energy determinations
IE (eV) | Method | Reference | Comment |
---|---|---|---|
8.5 | PE | Batich, Bischof, et al., 1973 | LLK |
8.64 ± 0.03 | PI | Demeo and El-Sayed, 1970 | RDSH |

References

Ziegler and Wilms, 1950
Ziegler, K.; Wilms, H.,
Polymembered Ring Systems XIII. Eight-membered Cycloolefin Rings,
Justus Liebigs Ann. Chem., 1950, 567, 1-43. [all data]
Turner, Mallon, et al., 1973
Turner, R.B.; Mallon, B.J.; Tichy, M.; Doering, W.v.E.; Roth, W.R.; Schroder, G.,
Heats of hydrogenation. X. Conjugative interaction in cyclic dienes and trienes,
J. Am. Chem. Soc., 1973, 95, 8605-8610. [all data]
Batich, Bischof, et al., 1973
Batich, C.; Bischof, P.; Heilbronner, E.,
The photoelectron spectra of cyclooctatetraene and its hydrogenated derivatives,
J. Electron Spectrosc. Relat. Phenom., 1973, 1, 333. [all data]
Demeo and El-Sayed, 1970
Demeo, D.A.; El-Sayed, M.A.,
Ionization potential and structure of olefins,
J. Chem. Phys., 1970, 52, 2622. [all data]