Methane, chloromethoxy-
- Formula: C2H5ClO
- Molecular weight: 80.513
- IUPAC Standard InChIKey: XJUZRXYOEPSWMB-UHFFFAOYSA-N
- CAS Registry Number: 107-30-2
- Chemical structure:
View 3d structure (requires JavaScript / HTML 5) - Other names: Ether, chloromethyl methyl; Chlorodimethyl ether; Chloromethoxymethane; Chloromethyl methyl ether; Methoxychloromethane; Methoxymethyl chloride; Methyl chloromethyl ether; Monochlorodimethyl ether; Monochloromethyl methyl ether; CH3OCH2Cl; Chlormethyl methyl ether; Chlordimethylether; CMME; Ether methylique monochlore; Ether, dimethyl chloro; Methyl chloromethyl ether, anhydrous; Rcra waste number U046; UN 1239; NSC 21208

Phase change data

Data compiled as indicated in comments:
BS - Robert L. Brown and Stephen E. Stein
TRC - Thermodynamics Research Center, NIST Boulder Laboratories, Chris Muzny director
AC - William E. Acree, Jr., James S. Chickos
Quantity | Value | Units | Method | Reference | Comment |
---|---|---|---|---|---|
Tboil | 329.2 | K | N/A | Aldrich Chemical Company Inc., 1990 | BS |
Tboil | 332.7 | K | N/A | Weast and Grasselli, 1989 | BS |
Tboil | 332.30 | K | N/A | Lecat, 1947 | Uncertainty assigned by TRC = 0.6 K; TRC |
Tboil | 332.30 | K | N/A | Lecat, 1927 | Uncertainty assigned by TRC = 0.5 K; TRC |
Enthalpy of vaporization
ΔvapH (kJ/mol) | Temperature (K) | Method | Reference | Comment |
---|---|---|---|---|
32.2 | 305. | A | Stephenson and Malanowski, 1987 | Based on data from 290. to 332. K.; AC |

Reaction thermochemistry data

Data compiled by: John E. Bartmess
Individual Reactions
C2H4ClO- + =
By formula: C2H4ClO- + H+ = C2H5ClO
Quantity | Value | Units | Method | Reference | Comment |
---|---|---|---|---|---|
ΔrG° | <1606.7 | kJ/mol | IMRB | Paulino and Squires, 1991 | gas phase; MeOCH2Cl is deprotonated by HO- |

Gas phase ion energetics data

Data compiled as indicated in comments:
B - John E. Bartmess
LLK - Sharon G. Lias, Rhoda D. Levin, and Sherif A. Kafafi
RDSH - Henry M. Rosenstock, Keith Draxl, Bruce W. Steiner, and John T. Herron
Ionization energy determinations
IE (eV) | Method | Reference | Comment |
---|---|---|---|
10.2 | PE | Vereschagin, Salikova, et al., 1980 | LLK |
10.87 | PE | Vereschagin, Salikova, et al., 1980 | Vertical value; LLK |
Appearance energy determinations
Ion | AE (eV) | Other Products | Method | Reference | Comment |
---|---|---|---|---|---|
C2H5O+ | 10.79 | Cl | EI | Haney and Franklin, 1969 | RDSH |
De-protonation reactions
C2H4ClO- + =
By formula: C2H4ClO- + H+ = C2H5ClO
Quantity | Value | Units | Method | Reference | Comment |
---|---|---|---|---|---|
ΔrG° | <1606.7 | kJ/mol | IMRB | Paulino and Squires, 1991 | gas phase; MeOCH2Cl is deprotonated by HO-; B |

References

Aldrich Chemical Company Inc., 1990
Aldrich Chemical Company Inc.,
Catalog Handbook of Fine Chemicals, Aldrich Chemical Company, Inc., Milwaukee WI, 1990, 1. [all data]
Weast and Grasselli, 1989
CRC Handbook of Data on Organic Compounds, 2nd Editon, Weast,R.C and Grasselli, J.G., ed(s)., CRC Press, Inc., Boca Raton, FL, 1989, 1. [all data]
Lecat, 1947
Lecat, M.,
Orthobaric Azeotropes of Sulfides,
Bull. Cl. Sci., Acad. R. Belg., 1947, 33, 160-82. [all data]
Lecat, 1927
Lecat, M.,
New binary azeotropes: 6th list,
Ann. Soc. Sci. Bruxelles, Ser. B, 1927, 47, 63-71. [all data]
Stephenson and Malanowski, 1987
Stephenson, Richard M.; Malanowski, Stanislaw,
Handbook of the Thermodynamics of Organic Compounds, 1987, https://doi.org/10.1007/978-94-009-3173-2
. [all data]
Paulino and Squires, 1991
Paulino, J.A.; Squires, R.R.,
Carbene Anion Complexes - Unusual Structural and Thermochemical Features of alpha-Halocarbanions in the Gas Phase,
J. Am. Chem. Soc., 1991, 113, 5, 1845, https://doi.org/10.1021/ja00005a067
. [all data]
Vereschagin, Salikova, et al., 1980
Vereschagin, A.N.; Salikova, A.M.; Zverev, V.V.; Saitkulova, F.G.; Villem, Y.Y.,
Physical properties, conformations, and intramolecular interactions of α, α-dichlorodimethyl ether,
Bull. Acad. Sci. USSR, Div. Chem. Sci., 1980, 997. [all data]
Haney and Franklin, 1969
Haney, M.A.; Franklin, J.L.,
Excess energies in mass spectra of some oxygen-containing organic compounds,
J. Chem. Soc. Faraday Trans., 1969, 65, 1794. [all data]