Acetaldoxime
- Formula: C2H5NO
- Molecular weight: 59.0672
- IUPAC Standard InChIKey: FZENGILVLUJGJX-UHFFFAOYSA-N
- CAS Registry Number: 107-29-9
- Chemical structure:
View 3d structure (requires JavaScript / HTML 5) - Other names: (E)-CH3CH=NOH; Acetaldehyde oxime; Acetaldoxime,syn & anti; Aldoxime; Ethanal oxime; Ethylidenehydroxylamine; USAF am-5; UN 2332

Gas phase thermochemistry data

Data compiled by: Hussein Y. Afeefy, Joel F. Liebman, and Stephen E. Stein
Quantity | Value | Units | Method | Reference | Comment |
---|---|---|---|---|---|
ΔfH°gas | -22.55 ± 0.29 | kJ/mol | Ccr | Steele, Chirico, et al., 1990 |

Condensed phase thermochemistry data

Data compiled as indicated in comments:
ALS - Hussein Y. Afeefy, Joel F. Liebman, and Stephen E. Stein
DH - Eugene S. Domalski and Elizabeth D. Hearing
Quantity | Value | Units | Method | Reference | Comment |
---|---|---|---|---|---|
ΔfH°liquid | -71.58 ± 0.28 | kJ/mol | Ccr | Steele, Chirico, et al., 1990 | ALS |
Quantity | Value | Units | Method | Reference | Comment |
ΔcH°liquid | -1430.01 ± 0.24 | kJ/mol | Ccr | Steele, Chirico, et al., 1990 | ALS |
Quantity | Value | Units | Method | Reference | Comment |
ΔfH°solid | -85.8 | kJ/mol | Ccb | Landrieu, 1905 | ALS |
Quantity | Value | Units | Method | Reference | Comment |
ΔcH°solid | -1425. | kJ/mol | Ccb | Landrieu, 1905 | ALS |
Constant pressure heat capacity of solid
Cp,solid (J/mol*K) | Temperature (K) | Reference | Comment |
---|---|---|---|
241.1 | 298.15 | Steele, Chirico, et al., 1990 | DH |

Phase change data

Data compiled as indicated in comments:
BS - Robert L. Brown and Stephen E. Stein
TRC - Thermodynamics Research Center, NIST Boulder Laboratories, Chris Muzny director
ALS - Hussein Y. Afeefy, Joel F. Liebman, and Stephen E. Stein
AC - William E. Acree, Jr., James S. Chickos
Quantity | Value | Units | Method | Reference | Comment |
---|---|---|---|---|---|
Tboil | 388.2 | K | N/A | Weast and Grasselli, 1989 | BS |
Tboil | 388. | K | N/A | American Tokyo Kasei, 1988 | BS |
Tboil | 387.15 | K | N/A | Bruhl, 1895 | Uncertainty assigned by TRC = 2. K; TRC |
Quantity | Value | Units | Method | Reference | Comment |
Tfus | 298.65 | K | N/A | Bruhl, 1895 | Uncertainty assigned by TRC = 1. K; TRC |
Quantity | Value | Units | Method | Reference | Comment |
ΔvapH° | 49.03 ± 0.07 | kJ/mol | V | Steele, Chirico, et al., 1990 | ALS |
Enthalpy of vaporization
ΔvapH (kJ/mol) | Temperature (K) | Method | Reference | Comment |
---|---|---|---|---|
48. | 303. | A | Stephenson and Malanowski, 1987 | Based on data from 288. to 388. K.; AC |

Reaction thermochemistry data

Data compiled by: John E. Bartmess
Individual Reactions
C2H4NO- + =
By formula: C2H4NO- + H+ = C2H5NO
Quantity | Value | Units | Method | Reference | Comment |
---|---|---|---|---|---|
ΔrH° | 1529. ± 9.2 | kJ/mol | G+TS | Bartmess, Scott, et al., 1979 | gas phase; value altered from reference due to change in acidity scale |
Quantity | Value | Units | Method | Reference | Comment |
ΔrG° | 1500. ± 8.4 | kJ/mol | IMRE | Bartmess, Scott, et al., 1979 | gas phase; value altered from reference due to change in acidity scale |

Gas phase ion energetics data

Data compiled as indicated in comments:
B - John E. Bartmess
LLK - Sharon G. Lias, Rhoda D. Levin, and Sherif A. Kafafi
RDSH - Henry M. Rosenstock, Keith Draxl, Bruce W. Steiner, and John T. Herron
Ionization energy determinations
IE (eV) | Method | Reference | Comment |
---|---|---|---|
10.0 | PE | Dargelos and Sandorfy, 1977 | LLK |
10.7 ± 0.2 | EI | Eastmond and Pratt, 1970 | RDSH |
10.20 | PE | Dargelos and Sandorfy, 1977 | Vertical value; LLK |
Appearance energy determinations
Ion | AE (eV) | Other Products | Method | Reference | Comment |
---|---|---|---|---|---|
CH2NO+ | 13.0 ± 0.2 | CH3 | EI | Eastmond and Pratt, 1970 | RDSH |
C2H3N+ | 12.9 ± 0.2 | H2O | EI | Eastmond and Pratt, 1970 | RDSH |
C2H4+ | 12.9 ± 0.2 | ? | EI | Eastmond and Pratt, 1970 | RDSH |
C2H4N+ | 11.3 ± 0.2 | OH | EI | Eastmond and Pratt, 1970 | RDSH |
C2H4NO+ | 10.2 ± 0.2 | H | EI | Eastmond and Pratt, 1970 | RDSH |
De-protonation reactions
C2H4NO- + =
By formula: C2H4NO- + H+ = C2H5NO
Quantity | Value | Units | Method | Reference | Comment |
---|---|---|---|---|---|
ΔrH° | 1529. ± 9.2 | kJ/mol | G+TS | Bartmess, Scott, et al., 1979 | gas phase; value altered from reference due to change in acidity scale; B |
Quantity | Value | Units | Method | Reference | Comment |
ΔrG° | 1500. ± 8.4 | kJ/mol | IMRE | Bartmess, Scott, et al., 1979 | gas phase; value altered from reference due to change in acidity scale; B |

Normal alkane RI, non-polar column, temperature ramp

Column type | Active phase | I | Reference | Comment |
---|---|---|---|---|
Capillary | OV-101 | 606. | Zenkevich, 2005 | 25. m/0.20 mm/0.10 μm, N2/He, 6. K/min; Tstart: 50. C; Tend: 250. C |

Normal alkane RI, polar column, custom temperature program

Column type | Active phase | I | Reference | Comment |
---|---|---|---|---|
Capillary | SOLGel-Wax | 1301. | Johanningsmeier and McFeeters, 2011 | 30. m/0.25 mm/0.25 μm, Helium; Program: 40 0C (2 min) 5 0C/min -> 140 0C 10 0C/min -> 250 0C (3 min) |

References

Steele, Chirico, et al., 1990
Steele, W.V.; Chirico, R.D.; Nguyen, A.; Hossenlopp, I.A.; Smith, N.K.,
Determination of ideal-gas enthalpies of formation for key compounds,
Am. Inst. Chem. Eng. Symp. Ser. (AIChE Symp. Ser.), 1990, 138-154. [all data]
Landrieu, 1905
Landrieu, Ph.,
Thermochimie. - Chaleur de formation des oximes,
C.R. Acad. Sc. Paris, 1905, 140, 867-870. [all data]
Weast and Grasselli, 1989
CRC Handbook of Data on Organic Compounds, 2nd Editon, Weast,R.C and Grasselli, J.G., ed(s)., CRC Press, Inc., Boca Raton, FL, 1989, 1. [all data]
American Tokyo Kasei, 1988
American Tokyo Kasei,
TCI American Organic Chemical 88/89 Catalog, American Tokyo Kasei, Portland, OR, 1988, 1610. [all data]
Bruhl, 1895
Bruhl, J.W.,
Spectrochemistry of Nitrogen-Containing Compounds. I.,
Z. Phys. Chem., Stoechiom. Verwandtschaftsl., 1895, 16, 193. [all data]
Stephenson and Malanowski, 1987
Stephenson, Richard M.; Malanowski, Stanislaw,
Handbook of the Thermodynamics of Organic Compounds, 1987, https://doi.org/10.1007/978-94-009-3173-2
. [all data]
Bartmess, Scott, et al., 1979
Bartmess, J.E.; Scott, J.A.; McIver, R.T., Jr.,
The gas phase acidity scale from methanol to phenol,
J. Am. Chem. Soc., 1979, 101, 6047. [all data]
Dargelos and Sandorfy, 1977
Dargelos, A.; Sandorfy, C.,
The photoelectron and far-ultraviolet absorption spectra of simple oximes,
J. Chem. Phys., 1977, 67, 3011. [all data]
Eastmond and Pratt, 1970
Eastmond, G.B.M.; Pratt, G.L.,
Pyrolyses in the presence of nitric oxide. Part III.Acetaldehyde oxime and nitrosoethane,
J. Chem. Soc. A, 1970, 2337. [all data]
Zenkevich, 2005
Zenkevich, I.G.,
Experimentally measured retention indices., 2005. [all data]
Johanningsmeier and McFeeters, 2011
Johanningsmeier, S.D.; McFeeters, R.F.,
Detection of volatile spoilage metabolites in fermented cucumbers using nontargeted, comprehensive 2-dimensional gas chromatography-time-of-flight mass spectrometry (GCxGCxTOFMS),
J. Food Sci., 2011, 76, 1, c168-c177, https://doi.org/10.1111/j.1750-3841.2010.01918.x
. [all data]