Ethene, methoxy-
- Formula: C3H6O
- Molecular weight: 58.0791
- IUPAC Standard InChIKey: XJRBAMWJDBPFIM-UHFFFAOYSA-N
- CAS Registry Number: 107-25-5
- Chemical structure:
View 3d structure (requires JavaScript / HTML 5) - Other names: Ether, methyl vinyl; Methoxyethylene; Methyl vinyl ether; Vinyl methyl ether; 1-Methoxyethylene; CH2=CHOCH3; Methoxyethene; UN 1087

Gas phase thermochemistry data

Data compiled by: Glushko Thermocenter, Russian Academy of Sciences, Moscow
Constant pressure heat capacity of gas
Cp,gas (J/mol*K) | Temperature (K) | Reference | Comment |
---|---|---|---|
79.50 | 298.15 | Cruickshank F.R., 1969 | |
79.91 | 300. | ||
99.16 | 400. | ||
115.90 | 500. | ||
130.12 | 600. | ||
151.04 | 800. | ||
166.94 | 1000. | ||
190.79 | 1500. |

Phase change data

Data compiled as indicated in comments:
BS - Robert L. Brown and Stephen E. Stein
AC - William E. Acree, Jr., James S. Chickos
Quantity | Value | Units | Method | Reference | Comment |
---|---|---|---|---|---|
Tboil | 278.7 | K | N/A | Aldrich Chemical Company Inc., 1990 | BS |
Enthalpy of vaporization
ΔvapH (kJ/mol) | Temperature (K) | Method | Reference | Comment |
---|---|---|---|---|
23.4 | 293. | A | Stephenson and Malanowski, 1987 | Based on data from 278. to 412. K.; AC |

Reaction thermochemistry data

Data compiled as indicated in comments:
B - John E. Bartmess
ALS - Hussein Y. Afeefy, Joel F. Liebman, and Stephen E. Stein
Individual Reactions
C3H5O- + =
By formula: C3H5O- + H+ = C3H6O
Quantity | Value | Units | Method | Reference | Comment |
---|---|---|---|---|---|
ΔrH° | 1720. ± 50. | kJ/mol | CIDT | Graul and Squires, 1990 | gas phase; B |
Quantity | Value | Units | Method | Reference | Comment |
ΔrG° | 1690. ± 50. | kJ/mol | H-TS | Graul and Squires, 1990 | gas phase; B |
C3H7ClO = +
By formula: C3H7ClO = C3H6O + HCl
Quantity | Value | Units | Method | Reference | Comment |
---|---|---|---|---|---|
ΔrH° | 71.1 | kJ/mol | Eqk | Cruickshank and Benson, 1969 | gas phase; ALS |

Gas phase ion energetics data

Data evaluated as indicated in comments:
HL - Edward P. Hunter and Sharon G. Lias
L - Sharon G. Lias
Data compiled as indicated in comments:
B - John E. Bartmess
LLK - Sharon G. Lias, Rhoda D. Levin, and Sherif A. Kafafi
RDSH - Henry M. Rosenstock, Keith Draxl, Bruce W. Steiner, and John T. Herron
Quantity | Value | Units | Method | Reference | Comment |
---|---|---|---|---|---|
IE (evaluated) | 8.95 ± 0.01 | eV | N/A | N/A | L |
Quantity | Value | Units | Method | Reference | Comment |
Proton affinity (review) | 859.2 | kJ/mol | N/A | Hunter and Lias, 1998 | HL |
Quantity | Value | Units | Method | Reference | Comment |
Gas basicity | 830.3 | kJ/mol | N/A | Hunter and Lias, 1998 | HL |
Ionization energy determinations
IE (eV) | Method | Reference | Comment |
---|---|---|---|
8.96 | PE | Planckaert, Doucet, et al., 1974 | LLK |
8.95 | PE | Mines and Thompson, 1973 | LLK |
8.93 ± 0.02 | PI | Watanabe, Nakayama, et al., 1962 | RDSH |
9.05 | PE | Bock, Wagner, et al., 1974 | Vertical value; LLK |
Appearance energy determinations
Ion | AE (eV) | Other Products | Method | Reference | Comment |
---|---|---|---|---|---|
C2H3O+ | 11.44 | CH3 | EI | Bernecker and Long, 1961 | RDSH |
De-protonation reactions
C3H5O- + =
By formula: C3H5O- + H+ = C3H6O
Quantity | Value | Units | Method | Reference | Comment |
---|---|---|---|---|---|
ΔrH° | 1720. ± 50. | kJ/mol | CIDT | Graul and Squires, 1990 | gas phase; B |
Quantity | Value | Units | Method | Reference | Comment |
ΔrG° | 1690. ± 50. | kJ/mol | H-TS | Graul and Squires, 1990 | gas phase; B |

Normal alkane RI, non-polar column, custom temperature program

Column type | Active phase | I | Reference | Comment |
---|---|---|---|---|
Capillary | Methyl Silicone | 416. | Zenkevich, 1999 | Program: not specified |
Capillary | Polydimethyl siloxanes | 416. | Zenkevich, 1997 | Program: not specified |

References

Cruickshank F.R., 1969
Cruickshank F.R.,
Thermodynamic properties of methyl vinyl ether, alpha-chloroethyl methyl ether, and iodomethyl methyl ether. Evidence for nonbonded electrostatic interactions,
J. Am. Chem. Soc., 1969, 91, 2487-2492. [all data]
Aldrich Chemical Company Inc., 1990
Aldrich Chemical Company Inc.,
Catalog Handbook of Fine Chemicals, Aldrich Chemical Company, Inc., Milwaukee WI, 1990, 1. [all data]
Stephenson and Malanowski, 1987
Stephenson, Richard M.; Malanowski, Stanislaw,
Handbook of the Thermodynamics of Organic Compounds, 1987, https://doi.org/10.1007/978-94-009-3173-2
. [all data]
Graul and Squires, 1990
Graul, S.T.; Squires, R.R.,
Gas-Phase Acidities Derived from Threshold Energies for Activated Reactions,
J. Am. Chem. Soc., 1990, 112, 7, 2517, https://doi.org/10.1021/ja00163a007
. [all data]
Cruickshank and Benson, 1969
Cruickshank, F.R.; Benson, S.W.,
Some thermochemical properties of methyl vinyl ether, α-chloroethyl methyl ether, and iodomethyl methyl ether. Evidence for nonbonded electrostatic interactions,
J. Am. Chem. Soc., 1969, 91, 2487-2490. [all data]
Hunter and Lias, 1998
Hunter, E.P.; Lias, S.G.,
Evaluated Gas Phase Basicities and Proton Affinities of Molecules: An Update,
J. Phys. Chem. Ref. Data, 1998, 27, 3, 413-656, https://doi.org/10.1063/1.556018
. [all data]
Planckaert, Doucet, et al., 1974
Planckaert, A.A.; Doucet, J.; Sandorfy, C.,
Comparative study of the vacuum ultraviolet absorption and photoelectron spectra of some simple ethers and thioethers,
J. Chem. Phys., 1974, 60, 4846. [all data]
Mines and Thompson, 1973
Mines, G.W.; Thompson, H.W.,
Photoelectron spectra of vinyl and allyl halides,
Spectrochim. Acta Part A, 1973, 29, 1377. [all data]
Watanabe, Nakayama, et al., 1962
Watanabe, K.; Nakayama, T.; Mottl, J.,
Ionization potentials of some molecules,
J. Quant. Spectry. Radiative Transfer, 1962, 2, 369. [all data]
Bock, Wagner, et al., 1974
Bock, H.; Wagner, G.; Wittel, K.; Sauer, J.; Seebach, D.,
Photoelektronenspektren und molekuleigenschaften. XXXII. n/π-konjugation in heterosubstituierten athylenen,
Chem. Ber., 1974, 107, 1869. [all data]
Bernecker and Long, 1961
Bernecker, R.R.; Long, F.,
Some organic positive ions and their parent radicals and molecules,
J. Phys. Chem., 1961, 65, 1565. [all data]
Zenkevich, 1999
Zenkevich, I.G.,
New Application of the Retention Index Concept in Gas and High Performance Liquid Chromatography,
Fresenius' J. Anal. Chem., 1999, 365, 4, 305-309, https://doi.org/10.1007/s002160051491
. [all data]
Zenkevich, 1997
Zenkevich, I.G.,
Influence of the Variations of Dynamics Molecular Parameterts on the Additivity of Chromatigraphic Retention Indices of Products of Organic Reactions Relative to Initial Reagents,
Dokl. Akad. Nauk (Rus.), 1997, 353, 5, 625-627. [all data]