1,1-Dimethyl-1-silacyclopentane
- Formula: C6H14Si
- Molecular weight: 114.2609
- IUPAC Standard InChIKey: KDQBKCRYCZJUAE-UHFFFAOYSA-N
- CAS Registry Number: 1072-54-4
- Chemical structure:
View 3d structure (requires JavaScript / HTML 5) - Other names: Silacyclopentane, 1,1-dimethyl-; Cyclotetramethylenedimethylsilane; 1,1-Dimethylsilacyclopentane

Gas phase ion energetics data

Data compiled as indicated in comments:
LLK - Sharon G. Lias, Rhoda D. Levin, and Sherif A. Kafafi
Ionization energy determinations
IE (eV) | Method | Reference | Comment |
---|---|---|---|
9.26 ± 0.03 | EI | Gusel'nikov, Volkova, et al., 1981 | LLK |
9.0 | PE | Cundy, Lappert, et al., 1973 | LLK |
9.75 | PE | Cundy, Lappert, et al., 1973 | Vertical value; LLK |
Appearance energy determinations
Ion | AE (eV) | Other Products | Method | Reference | Comment |
---|---|---|---|---|---|
C4H10Si+ | 9.76 ± 0.04 | C2H4 | EI | Gusel'nikov, Volkova, et al., 1981 | LLK |

References

Gusel'nikov, Volkova, et al., 1981
Gusel'nikov, L.E.; Volkova, V.V.; Tarasenko, N.A.; Tishenkov, A.A.; Zaikin, V.G.; Eremina, E.I.; Nametkin, N.S.,
Deuterium labelling and thermochemical studies of dissociative ionization of methyl substituted monosilacyclobutanes. Ring expansion in the molecular ion of 1,1,3-trimethylΣ-1-silacyclobutane,
Org. Mass Spectrom., 1981, 16, 242. [all data]
Cundy, Lappert, et al., 1973
Cundy, C.S.; Lappert, M.F.; Pedley, J.B.; Schmidt, W.; Wilkins, B.T.,
Bonding studies of compounds of boron and the Group IV elements. XI. Photoelectron spectra of strained cyclic organosilicon compounds,
J. Organomet. Chem., 1973, 51, 99. [all data]