Propargyl alcohol
- Formula: C3H4O
- Molecular weight: 56.0633
- IUPAC Standard InChIKey: TVDSBUOJIPERQY-UHFFFAOYSA-N
- CAS Registry Number: 107-19-7
- Chemical structure:
View 3d structure (requires JavaScript / HTML 5) - Other names: 2-Propyn-1-ol; Ethynyl carbinol; Propynyl alcohol; 1-Hydroxy-2-propyne; 1-Propyn-3-ol; 2-Propynol; 2-Propynyl alcohol; 3-Hydroxy-1-propyne; 1-Propyne-3-ol; 3-Propynol; prop-2-yn-1-ol; Methanol, ethynyl-; Rcra waste number P102; HC≡CCH2OH; 1-Propyn-3-yl alcohol; NSC 8804; 2-propyn-1-ol (propargyl alcohol)

Phase change data

Data compiled as indicated in comments:
BS - Robert L. Brown and Stephen E. Stein
TRC - Thermodynamics Research Center, NIST Boulder Laboratories, Chris Muzny director
AC - William E. Acree, Jr., James S. Chickos
Quantity | Value | Units | Method | Reference | Comment |
---|---|---|---|---|---|
Tboil | 387. to 388. | K | N/A | Farchan Laboratories, 1990 | BS |
Tboil | 386.8 | K | N/A | Weast and Grasselli, 1989 | BS |
Tboil | 386.75 | K | N/A | Henne and Greenlee, 1945 | Uncertainty assigned by TRC = 0.5 K; TRC |
Tboil | 385. | K | N/A | Bruhl, 1880 | Uncertainty assigned by TRC = 3. K; TRC |
Quantity | Value | Units | Method | Reference | Comment |
Tfus | 221.35 | K | N/A | Henne and Greenlee, 1945 | Uncertainty assigned by TRC = 0.3 K; TRC |
Enthalpy of vaporization
ΔvapH (kJ/mol) | Temperature (K) | Method | Reference | Comment |
---|---|---|---|---|
42.0 | 308. | A | Stephenson and Malanowski, 1987 | Based on data from 293. to 387. K.; AC |

Gas phase ion energetics data

Data evaluated as indicated in comments:
L - Sharon G. Lias
Data compiled as indicated in comments:
LBLHLM - Sharon G. Lias, John E. Bartmess, Joel F. Liebman, John L. Holmes, Rhoda D. Levin, and W. Gary Mallard
LLK - Sharon G. Lias, Rhoda D. Levin, and Sherif A. Kafafi
Quantity | Value | Units | Method | Reference | Comment |
---|---|---|---|---|---|
IE (evaluated) | 10.5 | eV | N/A | N/A | L |
Ionization energy determinations
IE (eV) | Method | Reference | Comment |
---|---|---|---|
10.51 | PE | Koppel, Molder, et al., 1983 | LBLHLM |
10.5 | PE | Von Niessen, Bieri, et al., 1980 | LLK |
10.45 | PE | Andreocci, Bitchev, et al., 1979 | Vertical value; LLK |

Kovats' RI, non-polar column, isothermal

Column type | Active phase | Temperature (C) | I | Reference | Comment |
---|---|---|---|---|---|
Capillary | SE-30 | 100. | 576. | Haken and Korhonen, 1985 | Column length: 25. m; Column diameter: 0.33 mm |
Capillary | SE-30 | 120. | 559. | Haken and Korhonen, 1985 | Column length: 25. m; Column diameter: 0.33 mm |
Capillary | SE-30 | 80. | 552. | Haken and Korhonen, 1985 | Column length: 25. m; Column diameter: 0.33 mm |
Capillary | SE-30 | 100. | 576. | Haken, Madden, et al., 1985 | N2; Column length: 25. m; Column diameter: 0.33 mm |
Capillary | SE-30 | 120. | 559. | Haken, Madden, et al., 1985 | N2; Column length: 25. m; Column diameter: 0.33 mm |
Capillary | SE-30 | 140. | 569. | Haken, Madden, et al., 1985 | N2; Column length: 25. m; Column diameter: 0.33 mm |
Capillary | SE-30 | 80. | 552. | Haken, Madden, et al., 1985 | N2; Column length: 25. m; Column diameter: 0.33 mm |

Kovats' RI, polar column, isothermal

Column type | Active phase | Temperature (C) | I | Reference | Comment |
---|---|---|---|---|---|
Capillary | OV-351 | 100. | 1343. | Haken and Korhonen, 1985 | N2; Column length: 25. m; Column diameter: 0.32 mm |
Capillary | OV-351 | 120. | 1334. | Haken and Korhonen, 1985 | N2; Column length: 25. m; Column diameter: 0.32 mm |
Capillary | OV-351 | 80. | 1352. | Haken and Korhonen, 1985 | N2; Column length: 25. m; Column diameter: 0.32 mm |
Capillary | OV-351 | 100. | 1343. | Haken, Madden, et al., 1985 | N2; Column length: 25. m; Column diameter: 0.32 mm |
Capillary | OV-351 | 120. | 1334. | Haken, Madden, et al., 1985 | N2; Column length: 25. m; Column diameter: 0.32 mm |
Capillary | OV-351 | 80. | 1352. | Haken, Madden, et al., 1985 | N2; Column length: 25. m; Column diameter: 0.32 mm |

Van Den Dool and Kratz RI, non-polar column, temperature ramp

Column type | Active phase | I | Reference | Comment |
---|---|---|---|---|
Capillary | SE-30 | 546. | Korhonen, 1984 | N2, 6. K/min; Column length: 25. m; Column diameter: 0.30 mm; Tstart: 50. C |

Van Den Dool and Kratz RI, non-polar column, custom temperature program

Column type | Active phase | I | Reference | Comment |
---|---|---|---|---|
Packed | SE-30 | 559. | Peng, Ding, et al., 1988 | Supelcoport; Chromosorb; Column length: 3.05 m; Program: 40C(5min) => 10C/min => 200C or 250C (60min) |

Van Den Dool and Kratz RI, polar column, temperature ramp

Column type | Active phase | I | Reference | Comment |
---|---|---|---|---|
Capillary | OV-351 | 1320. | Korhonen, 1984 | N2, 6. K/min; Column length: 25. m; Column diameter: 0.32 mm; Tstart: 50. C |

Normal alkane RI, non-polar column, temperature ramp

Column type | Active phase | I | Reference | Comment |
---|---|---|---|---|
Capillary | OV-101 | 566. | Zenkevich, 2005 | 25. m/0.20 mm/0.10 μm, N2/He, 6. K/min; Tstart: 50. C; Tend: 250. C |

Normal alkane RI, non-polar column, custom temperature program

Column type | Active phase | I | Reference | Comment |
---|---|---|---|---|
Capillary | OV-1, SE-30, Methyl silicone, SP-2100, OV-101, DB-1, etc. | 546. | Waggott and Davies, 1984 | Hydrogen; Column length: 50. m; Column diameter: 0.32 mm; Program: not specified |

Normal alkane RI, polar column, custom temperature program

Column type | Active phase | I | Reference | Comment |
---|---|---|---|---|
Capillary | DB-Wax | 1357. | Peng, Yang, et al., 1991 | Program: not specified |

References

Farchan Laboratories, 1990
Farchan Laboratories,
Research Chemicals Catalog, Farchan Laboratories, Gainesville, FL, 1990, 91. [all data]
Weast and Grasselli, 1989
CRC Handbook of Data on Organic Compounds, 2nd Editon, Weast,R.C and Grasselli, J.G., ed(s)., CRC Press, Inc., Boca Raton, FL, 1989, 1. [all data]
Henne and Greenlee, 1945
Henne, A.L.; Greenlee, K.W.,
Preparation and Physical Constants of Acetylenic Compounds,
J. Am. Chem. Soc., 1945, 67, 484-5. [all data]
Bruhl, 1880
Bruhl, J.W.,
The Chemical Constitution of Organic Compounds in Relation to Their Density and Their Light Propagating Ability,
Justus Liebigs Ann. Chem., 1880, 200, 139-231. [all data]
Stephenson and Malanowski, 1987
Stephenson, Richard M.; Malanowski, Stanislaw,
Handbook of the Thermodynamics of Organic Compounds, 1987, https://doi.org/10.1007/978-94-009-3173-2
. [all data]
Koppel, Molder, et al., 1983
Koppel, I.A.; Molder, U.H.; Pikver, R.J.,
Photoelectron spectra of molecules. I. Alcohols,
Org. React. Tartu, 1983, 20, 45. [all data]
Von Niessen, Bieri, et al., 1980
Von Niessen, W.; Bieri, G.; Asbrink, L.,
30.4 nm He(II) photoelectron spectra of organic molecules. Part III. Oxo-compounds (C,H,O),
J. Electron Spectrosc. Relat. Phenom., 1980, 21, 175. [all data]
Andreocci, Bitchev, et al., 1979
Andreocci, M.V.; Bitchev, P.; Carusi, P.; Furlani, A.,
Valence shell photoionization spectra of some substituted hydroxy-acetylenes. A tentative correlation with their cyclotrimerization reactions,
J. Electron Spectrosc. Relat. Phenom., 1979, 16, 25. [all data]
Haken and Korhonen, 1985
Haken, J.K.; Korhonen, I.O.O.,
Gas-liquid chromatography of homologous esters. XXIX. Propanoyl and monochlorpropanoyl esters of lower saturated branched-chain and unsaturated alcohols,
J. Chromatogr., 1985, 324, 343-353, https://doi.org/10.1016/S0021-9673(01)81333-9
. [all data]
Haken, Madden, et al., 1985
Haken, J.K.; Madden, B.G.; Korhonen, I.O.O.,
Gas chromatography of homologous esters. XXXI. Butanoyl and monochlorobutanoyl esters of lower saturated branched chain and unsaturated alcohols on SE-30 and OV-351 capillary columns,
J. Chromatogr., 1985, 325, 61-73, https://doi.org/10.1016/S0021-9673(00)96008-4
. [all data]
Korhonen, 1984
Korhonen, I.O.O.,
Gas-Liquid Chromatographic Analyses. XXVI. Separation of Unsaturated Alcohols and Their Acetyl and Haloacetyl Derivatives on Capillary Columns Coated with SE-30 and OV-351,
J. Chromatogr., 1984, 288, 329-346, https://doi.org/10.1016/S0021-9673(01)93710-0
. [all data]
Peng, Ding, et al., 1988
Peng, C.T.; Ding, S.F.; Hua, R.L.; Yang, Z.C.,
Prediction of Retention Indexes I. Structure-Retention Index Relationship on Apolar Columns,
J. Chromatogr., 1988, 436, 137-172, https://doi.org/10.1016/S0021-9673(00)94575-8
. [all data]
Zenkevich, 2005
Zenkevich, I.G.,
Experimentally measured retention indices., 2005. [all data]
Waggott and Davies, 1984
Waggott, A.; Davies, I.W.,
Identification of organic pollutants using linear temperature programmed retention indices (LTPRIs) - Part II, 1984, retrieved from http://dwi.defra.gov.uk/research/completed-research/reports/dwi0383.pdf. [all data]
Peng, Yang, et al., 1991
Peng, C.T.; Yang, Z.C.; Ding, S.F.,
Prediction of rentention idexes. II. Structure-retention index relationship on polar columns,
J. Chromatogr., 1991, 586, 1, 85-112, https://doi.org/10.1016/0021-9673(91)80028-F
. [all data]