2-Pentanone, 5-hydroxy-
- Formula: C5H10O2
- Molecular weight: 102.1317
- IUPAC Standard InChIKey: JSHPTIGHEWEXRW-UHFFFAOYSA-N
- CAS Registry Number: 1071-73-4
- Chemical structure:
View 3d structure (requires JavaScript / HTML 5) - Other names: γ-Acetopropanol; 3-Acetopropanol; γ-Acetopropyl alcohol; 3-Acetylpropanol; 3-Acetyl-1-propanol; γ-Acetylpropyl alcohol; 5-Hydroxy-2-pentanone; 4-Oxo-1-pentanol; 1-Pentanol-4-one; Acetopropyl alcohol; Propanol, 3-acetyl-; NSC 19158; NSC 33940; 5-hydroxypentan-2-one

Phase change data

Data compiled by: Robert L. Brown and Stephen E. Stein
Reduced pressure boiling point
Tboil (K) | Pressure (bar) | Reference |
---|---|---|
481.2 | 0.973 | Weast and Grasselli, 1989 |

Reaction thermochemistry data

Data compiled by: Hussein Y. Afeefy, Joel F. Liebman, and Stephen E. Stein
Individual Reactions
By formula: C5H10O2 = C5H10O2
Quantity | Value | Units | Method | Reference | Comment |
---|---|---|---|---|---|
ΔrH° | 3. | kJ/mol | Eqk | Whiting and Edward, 1971 | liquid phase; solvent: Dioxane |

Gas phase ion energetics data

Data compiled by: Sharon G. Lias and Joel F. Liebman
Appearance energy determinations
Ion | AE (eV) | Other Products | Method | Reference | Comment |
---|---|---|---|---|---|
C3H7O+ | 10.30 | C2H3O | EI | Holmes, Lossing, et al., 1991 |

References

Weast and Grasselli, 1989
CRC Handbook of Data on Organic Compounds, 2nd Editon, Weast,R.C and Grasselli, J.G., ed(s)., CRC Press, Inc., Boca Raton, FL, 1989, 1. [all data]
Whiting and Edward, 1971
Whiting, J.E.; Edward, J.T.,
Ring-chain tautomerism of hydroxy ketones,
Can. J. Chem., 1971, 49, 3799-38. [all data]
Holmes, Lossing, et al., 1991
Holmes, J.L.; Lossing, F.P.; Mayer, P.M.,
Heats of formation of oxygen-containing organic free radicals from appearance energy measurements,
J. Am. Chem. Soc., 1991, 113, 9723. [all data]