Diisopropyl mercury
- Formula: C6H14Hg
- Molecular weight: 286.77
- CAS Registry Number: 1071-39-2

Gas phase thermochemistry data

Data compiled by: José A. Martinho Simões
Quantity | Value | Units | Method | Reference | Comment |
---|---|---|---|---|---|
ΔfH°gas | 91.2 ± 4.6 | kJ/mol | Review | Martinho Simões | |
ΔfH°gas | 36.9 ± 6.2 | kJ/mol | Review | Martinho Simões | Selected data |

Condensed phase thermochemistry data

Data compiled by: José A. Martinho Simões
Quantity | Value | Units | Method | Reference | Comment |
---|---|---|---|---|---|
ΔfH°liquid | 37.6 ± 4.3 | kJ/mol | Review | Martinho Simões | |
ΔfH°liquid | -16.7 ± 6.0 | kJ/mol | Review | Martinho Simões | Selected data |
Quantity | Value | Units | Method | Reference | Comment |
ΔcH°liquid | -4399.5 ± 4.2 | kJ/mol | CC-SB | Jones, Evans, et al., 1935 | Please also see Cox and Pilcher, 1970. |

Gas phase ion energetics data

Data compiled as indicated in comments:
LLK - Sharon G. Lias, Rhoda D. Levin, and Sherif A. Kafafi
RDSH - Henry M. Rosenstock, Keith Draxl, Bruce W. Steiner, and John T. Herron
Ionization energy determinations
IE (eV) | Method | Reference | Comment |
---|---|---|---|
7.6 ± 0.1 | EI | Gowenlock, Haynes, et al., 1962 | RDSH |
8.03 | PE | Fehlner, Ulman, et al., 1976 | Vertical value; LLK |
Appearance energy determinations
Ion | AE (eV) | Other Products | Method | Reference | Comment |
---|---|---|---|---|---|
C3H7+ | 9.7 ± 0.1 | ? | EI | Gowenlock, Haynes, et al., 1962 | RDSH |
C3H7Hg+ | 9.1 ± 0.1 | C3H7 | EI | Gowenlock, Haynes, et al., 1962 | RDSH |

Phase change data

Data compiled by: José A. Martinho Simões
Quantity | Value | Units | Method | Reference | Comment |
---|---|---|---|---|---|
ΔvapH° | 53.6 ± 1.7 | kJ/mol | CC-SB | Tees, 1952 |

Reaction thermochemistry data

Data compiled as indicated in comments:
MS - José A. Martinho Simões
ALS - Hussein Y. Afeefy, Joel F. Liebman, and Stephen E. Stein
Individual Reactions
C6H14Hg (l) + Cl2Hg (cr) = 2C3H7ClHg (cr)
By formula: C6H14Hg (l) + Cl2Hg (cr) = 2C3H7ClHg (cr)
Quantity | Value | Units | Method | Reference | Comment |
---|---|---|---|---|---|
ΔrH° | -22.5 ± 0.50 | kcal/mol | RSC | Mortimer, Pritchard, et al., 1952 | Please also see Pedley and Rylance, 1977 and Cox and Pilcher, 1970.; MS |
C6H14Hg (l) + (cr) = 2C3H7BrHg (cr)
By formula: C6H14Hg (l) + Br2Hg (cr) = 2C3H7BrHg (cr)
Quantity | Value | Units | Method | Reference | Comment |
---|---|---|---|---|---|
ΔrH° | -21.2 ± 0.36 | kcal/mol | RSC | Mortimer, Pritchard, et al., 1952 | Please also see Pedley and Rylance, 1977 and Cox and Pilcher, 1970.; MS |
C6H14Hg (l) + (cr) = 2C3H7HgI (cr)
By formula: C6H14Hg (l) + HgI2 (cr) = 2C3H7HgI (cr)
Quantity | Value | Units | Method | Reference | Comment |
---|---|---|---|---|---|
ΔrH° | -15.6 ± 0.41 | kcal/mol | RSC | Mortimer, Pritchard, et al., 1952 | Please also see Pedley and Rylance, 1977 and Cox and Pilcher, 1970.; MS |
By formula: 2C3H7I + HgI2 = C6H14Hg + 2I2
Quantity | Value | Units | Method | Reference | Comment |
---|---|---|---|---|---|
ΔrH° | 57.92 ± 0.46 | kcal/mol | Cm | Mortimer, Pritchard, et al., 1952, 2 | liquid phase; ALS |

References

Martinho Simões
Martinho Simões, J.A.,
Private communication (see http://webbook.nist.gov/chemistry/om/). [all data]
Jones, Evans, et al., 1935
Jones, W.J.; Evans, D.P.; Gulwell, T.; Griffiths, D.C.,
J. Chem. Soc., 1935, 39.. [all data]
Cox and Pilcher, 1970
Cox, J.D.; Pilcher, G.,
Thermochemistry of Organic and Organometallic Compounds
in Academic Press, New York, 1970. [all data]
Gowenlock, Haynes, et al., 1962
Gowenlock, B.G.; Haynes, R.M.; Majer, J.R.,
Electron impact measurement on some organomercury compounds,
J. Chem. Soc. Faraday Trans., 1962, 58, 1905. [all data]
Fehlner, Ulman, et al., 1976
Fehlner, T.P.; Ulman, J.; Nugent, W.A.; Kochi, J.K.,
Effect of alkyl substituents on the first ionization potential and on 5d10 ionization in dialkylmercury compounds,
Inorg. Chem., 1976, 15, 2544. [all data]