2-Propen-1-amine
- Formula: C3H7N
- Molecular weight: 57.0944
- IUPAC Standard InChIKey: VVJKKWFAADXIJK-UHFFFAOYSA-N
- CAS Registry Number: 107-11-9
- Chemical structure:
View 3d structure (requires JavaScript / HTML 5) - Other names: Allylamine; Monoallylamine; 3-Amino-1-propene; 3-Aminopropene; 3-Aminopropylene; CH2=CHCH2NH2; 2-Propenamine; 2-Propenylamine; UN 2334; NSC 7600

Condensed phase thermochemistry data

Data compiled by: Hussein Y. Afeefy, Joel F. Liebman, and Stephen E. Stein
Quantity | Value | Units | Method | Reference | Comment |
---|---|---|---|---|---|
ΔfH°liquid | 10. | kJ/mol | Ccb | Lemoult, 1907 | |
Quantity | Value | Units | Method | Reference | Comment |
ΔcH°liquid | -2204. | kJ/mol | Ccb | Lemoult, 1907 |

Phase change data

Data compiled as indicated in comments:
BS - Robert L. Brown and Stephen E. Stein
TRC - Thermodynamics Research Center, NIST Boulder Laboratories, Chris Muzny director
AC - William E. Acree, Jr., James S. Chickos
Quantity | Value | Units | Method | Reference | Comment |
---|---|---|---|---|---|
Tboil | 326.2 | K | N/A | Aldrich Chemical Company Inc., 1990 | BS |
Tboil | 331.2 | K | N/A | Weast and Grasselli, 1989 | BS |
Tboil | 326.45 | K | N/A | Perkin, 1889 | Uncertainty assigned by TRC = 1. K; TRC |
Enthalpy of vaporization
ΔvapH (kJ/mol) | Temperature (K) | Method | Reference | Comment |
---|---|---|---|---|
33.0 | 288. | A | Stephenson and Malanowski, 1987 | Based on data from 273. to 303. K.; AC |
32.6 | 288. | A | Stephenson and Malanowski, 1987 | Based on data from 273. to 324. K.; AC |

Gas phase ion energetics data

Data evaluated as indicated in comments:
HL - Edward P. Hunter and Sharon G. Lias
Data compiled as indicated in comments:
LLK - Sharon G. Lias, Rhoda D. Levin, and Sherif A. Kafafi
Quantity | Value | Units | Method | Reference | Comment |
---|---|---|---|---|---|
Proton affinity (review) | 909.5 | kJ/mol | N/A | Hunter and Lias, 1998 | HL |
Quantity | Value | Units | Method | Reference | Comment |
Gas basicity | 875.5 | kJ/mol | N/A | Hunter and Lias, 1998 | HL |
Ionization energy determinations
IE (eV) | Method | Reference | Comment |
---|---|---|---|
8.8 | PE | Aue and Bowers, 1979 | LLK |
8.76 | PE | Katrib and Rabalais, 1973 | LLK |
9.4 ± 0.3 | PE | Peel and Willett, 1977 | Vertical value; LLK |

Kovats' RI, non-polar column, isothermal

Column type | Active phase | Temperature (C) | I | Reference | Comment |
---|---|---|---|---|---|
Packed | OV-101 | 130. | 463. | Osmialowski, Halkiewicz, et al., 1985 | Ar, Chromosorb W HP; Column length: 1. m |

Normal alkane RI, non-polar column, isothermal

Column type | Active phase | Temperature (C) | I | Reference | Comment |
---|---|---|---|---|---|
Capillary | OV-101 | 130. | 463. | Qi, Yang, et al., 2000 |

Normal alkane RI, non-polar column, temperature ramp

Column type | Active phase | I | Reference | Comment |
---|---|---|---|---|
Capillary | OV-101 | 468. | Zenkevich, 2005 | 25. m/0.20 mm/0.10 μm, N2/He, 6. K/min; Tstart: 50. C; Tend: 250. C |

Normal alkane RI, non-polar column, custom temperature program

Column type | Active phase | I | Reference | Comment |
---|---|---|---|---|
Capillary | OV-1, SE-30, Methyl silicone, SP-2100, OV-101, DB-1, etc. | 463. | Waggott and Davies, 1984 | Hydrogen; Column length: 50. m; Column diameter: 0.32 mm; Program: not specified |

References

Lemoult, 1907
Lemoult, M.P.,
Recherches theoriques et experimentales sur les chaleurs de combustion et de formation des composes organiques,
Ann. Chim. Phys., 1907, 12, 395-432. [all data]
Aldrich Chemical Company Inc., 1990
Aldrich Chemical Company Inc.,
Catalog Handbook of Fine Chemicals, Aldrich Chemical Company, Inc., Milwaukee WI, 1990, 1. [all data]
Weast and Grasselli, 1989
CRC Handbook of Data on Organic Compounds, 2nd Editon, Weast,R.C and Grasselli, J.G., ed(s)., CRC Press, Inc., Boca Raton, FL, 1989, 1. [all data]
Perkin, 1889
Perkin, W.H.,
The Magneto Rotatory Power of Nitrogne Compounds. also of Hydrochloric Hydrobromic and Hydroioidic Acids and of some of the Salts of Ammonia and the Compound Ammonias,
J. Chem. Soc., 1889, 55, 680. [all data]
Stephenson and Malanowski, 1987
Stephenson, Richard M.; Malanowski, Stanislaw,
Handbook of the Thermodynamics of Organic Compounds, 1987, https://doi.org/10.1007/978-94-009-3173-2
. [all data]
Hunter and Lias, 1998
Hunter, E.P.; Lias, S.G.,
Evaluated Gas Phase Basicities and Proton Affinities of Molecules: An Update,
J. Phys. Chem. Ref. Data, 1998, 27, 3, 413-656, https://doi.org/10.1063/1.556018
. [all data]
Aue and Bowers, 1979
Aue, D.H.; Bowers, M.T.,
Chapter 9. Stabilities of positive ions from equilibrium gas phase basicity measurements
in Ions Chemistry,, ed. M.T. Bowers, 1979. [all data]
Katrib and Rabalais, 1973
Katrib, A.; Rabalais, J.W.,
Electronic interaction between the vinyl group and its substituents,
J. Phys. Chem., 1973, 77, 2358. [all data]
Peel and Willett, 1977
Peel, J.B.; Willett, G.D.,
Photoelectron spectroscopic studies of the propyl- and allyl- substituted amines,
Aust. J. Chem., 1977, 30, 2571. [all data]
Perkampus and Braunschweig, 1966
Perkampus, H.-H.; Braunschweig, T.H.,
UV atlas of organic compounds, 1966, 1, A1/12. [all data]
Osmialowski, Halkiewicz, et al., 1985
Osmialowski, K.; Halkiewicz, J.; Radecki, A.; Kaliszan, R.,
Quantum chemical parameters in correlation analysis of gas-liquid chromatographic retention indices of amines,
J. Chromatogr., 1985, 346, 53-60, https://doi.org/10.1016/S0021-9673(00)90493-X
. [all data]
Qi, Yang, et al., 2000
Qi, Y.; Yang, J.; Xu, L.,
correlation analysis of the structures and gas liquid chromatographic retention indices of amines,
Chin. J. Anal. Chem., 2000, 28, 2, 223-227. [all data]
Zenkevich, 2005
Zenkevich, I.G.,
Experimentally measured retention indices., 2005. [all data]
Waggott and Davies, 1984
Waggott, A.; Davies, I.W.,
Identification of organic pollutants using linear temperature programmed retention indices (LTPRIs) - Part II, 1984, retrieved from http://dwi.defra.gov.uk/research/completed-research/reports/dwi0383.pdf. [all data]