Butanoic acid, 3,3-dimethyl-
- Formula: C6H12O2
- Molecular weight: 116.1583
- IUPAC Standard InChIKey: MLMQPDHYNJCQAO-UHFFFAOYSA-N
- CAS Registry Number: 1070-83-3
- Chemical structure:
View 3d structure (requires JavaScript / HTML 5) - Other names: Butyric acid, 3,3-dimethyl-; tert-Butylacetic acid; 3,3-Dimethylbutanoic acid; 3,3-Dimethylbutyric acid; (CH3)3CCH2COOH; t-Butylacetic acid; 3,3-Dimethyl-n-butyric acid

Phase change data

Data compiled as indicated in comments:
BS - Robert L. Brown and Stephen E. Stein
TRC - Thermodynamics Research Center, NIST Boulder Laboratories, Chris Muzny director
AC - William E. Acree, Jr., James S. Chickos
Quantity | Value | Units | Method | Reference | Comment |
---|---|---|---|---|---|
Tboil | 460.7 | K | N/A | Aldrich Chemical Company Inc., 1990 | BS |
Tboil | 463.2 | K | N/A | Weast and Grasselli, 1989 | BS |
Quantity | Value | Units | Method | Reference | Comment |
Tfus | 280. | K | N/A | Homeyer, Whitmore, et al., 1933 | Uncertainty assigned by TRC = 2. K; TRC |
Quantity | Value | Units | Method | Reference | Comment |
ΔvapH° | 64.0 ± 0.9 | kJ/mol | GS | Verevkin, 2000 | Based on data from 283. to 325. K.; AC |
Enthalpy of vaporization
ΔvapH (kJ/mol) | Temperature (K) | Method | Reference | Comment |
---|---|---|---|---|
63.6 ± 0.9 | 304. | GS | Verevkin, 2000 | Based on data from 283. to 325. K.; AC |

Gas phase ion energetics data

Data compiled as indicated in comments:
B - John E. Bartmess
LL - Sharon G. Lias and Joel F. Liebman
Appearance energy determinations
Ion | AE (eV) | Other Products | Method | Reference | Comment |
---|---|---|---|---|---|
C2H3O2+ | 10.12 | C4H9 | EI | Holmes, Lossing, et al., 1991 | LL |
De-protonation reactions
C6H11O2- + =
By formula: C6H11O2- + H+ = C6H12O2
Quantity | Value | Units | Method | Reference | Comment |
---|---|---|---|---|---|
ΔrH° | 1443. ± 8.8 | kJ/mol | G+TS | Caldwell, Renneboog, et al., 1989 | gas phase; B |
ΔrH° | 1444. ± 8.8 | kJ/mol | G+TS | Taft and Topsom, 1987 | gas phase; B |
Quantity | Value | Units | Method | Reference | Comment |
ΔrG° | 1413. ± 8.4 | kJ/mol | IMRE | Caldwell, Renneboog, et al., 1989 | gas phase; B |
ΔrG° | 1415. ± 8.4 | kJ/mol | IMRE | Taft and Topsom, 1987 | gas phase; B |

References

Aldrich Chemical Company Inc., 1990
Aldrich Chemical Company Inc.,
Catalog Handbook of Fine Chemicals, Aldrich Chemical Company, Inc., Milwaukee WI, 1990, 1. [all data]
Weast and Grasselli, 1989
CRC Handbook of Data on Organic Compounds, 2nd Editon, Weast,R.C and Grasselli, J.G., ed(s)., CRC Press, Inc., Boca Raton, FL, 1989, 1. [all data]
Homeyer, Whitmore, et al., 1933
Homeyer, A.H.; Whitmore, F.C.; Wallingford, V.H.,
Preparation of tert-Butylacetic Acid and its Derivatives.,
J. Am. Chem. Soc., 1933, 55, 4209-214. [all data]
Verevkin, 2000
Verevkin, S.P.,
Measurement and Prediction of the Monocarboxylic Acids Thermochemical Properties,
J. Chem. Eng. Data, 2000, 45, 5, 953-960, https://doi.org/10.1021/je990282m
. [all data]
Holmes, Lossing, et al., 1991
Holmes, J.L.; Lossing, F.P.; Mayer, P.M.,
Heats of formation of oxygen-containing organic free radicals from appearance energy measurements,
J. Am. Chem. Soc., 1991, 113, 9723. [all data]
Caldwell, Renneboog, et al., 1989
Caldwell, G.; Renneboog, R.; Kebarle, P.,
Gas Phase Acidities of Aliphatic Carboxylic Acids, Based on Measurements of Proton Transfer Equilibria,
Can. J. Chem., 1989, 67, 4, 661, https://doi.org/10.1139/v89-092
. [all data]
Taft and Topsom, 1987
Taft, R.W.; Topsom, R.D.,
The Nature and Analysis of Substituent Effects,
Prog. Phys. Org. Chem., 1987, 16, 1. [all data]