Allyl chloride
- Formula: C3H5Cl
- Molecular weight: 76.525
- IUPAC Standard InChIKey: OSDWBNJEKMUWAV-UHFFFAOYSA-N
- CAS Registry Number: 107-05-1
- Chemical structure:
View 3d structure (requires JavaScript / HTML 5) - Other names: 1-Propene, 3-chloro-; Propene, 3-chloro-; 1-Chloro-2-propene; 2-Propenyl chloride; 3-Chloro-1-propene; 3-Chloropropene; 3-Chloropropylene; CH2=CHCH2Cl; Chloroallylene; Allile(cloruro di); Allylchlorid; Allyle(chlorure d'); Chlorallylene; NCI-C04615; 1-Chloropropene-2; 3-Chloropropene-1; 3-Chlorpropen; α-Chloropropylene; 3-Chloro-1-propylene; UN 1100; NSC 20939; 3-chloropropene (allyl chloride)

Condensed phase thermochemistry data

Data compiled by: Eugene S. Domalski and Elizabeth D. Hearing
Constant pressure heat capacity of liquid
Cp,liquid (J/mol*K) | Temperature (K) | Reference | Comment |
---|---|---|---|
125.1 | 298. | von Reis, 1881 | T = 289 to 334 K. |

Phase change data

Data compiled as indicated in comments:
BS - Robert L. Brown and Stephen E. Stein
TRC - Thermodynamics Research Center, NIST Boulder Laboratories, Chris Muzny director
AC - William E. Acree, Jr., James S. Chickos
Quantity | Value | Units | Method | Reference | Comment |
---|---|---|---|---|---|
Tboil | 318.2 ± 0.7 | K | AVG | N/A | Average of 12 values; Individual data points |
Quantity | Value | Units | Method | Reference | Comment |
Tfus | 138.65 | K | N/A | Timmermans, 1952 | Uncertainty assigned by TRC = 0.5 K; TRC |
Tfus | 136.75 | K | N/A | Timmermans, 1911 | Uncertainty assigned by TRC = 0.4 K; TRC |
Quantity | Value | Units | Method | Reference | Comment |
ΔvapH° | 29.9 | kJ/mol | N/A | Djkyj, Paulech, et al., 1960 | Based on data from 276. to 320. K.; AC |
Enthalpy of vaporization
ΔvapH (kJ/mol) | Temperature (K) | Method | Reference | Comment |
---|---|---|---|---|
33.1 | 218. | A | Stephenson and Malanowski, 1987 | Based on data from 203. to 318. K.; AC |
30.0 | 301. | N/A | Ioffe and Yamp'olskaya, 1944 | Based on data from 286. to 317. K. See also Boublik, Fried, et al., 1984.; AC |
Antoine Equation Parameters
log10(P) = A − (B / (T + C))
P = vapor pressure (bar)
T = temperature (K)
View plot Requires a JavaScript / HTML 5 canvas capable browser.
Temperature (K) | A | B | C | Reference | Comment |
---|---|---|---|---|---|
286.4 to 317.1 | 2.24083 | 365.121 | -154.919 | Joffe and Jampolskaja, 1944 | Coefficents calculated by NIST from author's data. |

Henry's Law data

Data compiled by: Rolf Sander
Henry's Law constant (water solution)
kH(T) = k°H exp(d(ln(kH))/d(1/T) ((1/T) - 1/(298.15 K)))
k°H = Henry's law constant for solubility in water at 298.15 K (mol/(kg*bar))
d(ln(kH))/d(1/T) = Temperature dependence constant (K)
k°H (mol/(kg*bar)) | d(ln(kH))/d(1/T) (K) | Method | Reference | Comment |
---|---|---|---|---|
0.11 | Q | N/A | missing citation give several references for the Henry's law constants but don't assign them to specific species. | |
0.092 | V | N/A | ||
0.11 | V | N/A |

Gas phase ion energetics data

Data evaluated as indicated in comments:
L - Sharon G. Lias
Data compiled as indicated in comments:
B - John E. Bartmess
LBLHLM - Sharon G. Lias, John E. Bartmess, Joel F. Liebman, John L. Holmes, Rhoda D. Levin, and W. Gary Mallard
LLK - Sharon G. Lias, Rhoda D. Levin, and Sherif A. Kafafi
Quantity | Value | Units | Method | Reference | Comment |
---|---|---|---|---|---|
IE (evaluated) | 10.05 ± 0.01 | eV | N/A | N/A | L |
Ionization energy determinations
IE (eV) | Method | Reference | Comment |
---|---|---|---|
10.05 | PI | Traeger, 1984 | LBLHLM |
9.9 | PE | Bieri, Asbrink, et al., 1982 | LBLHLM |
10.04 ± 0.01 | PI | Buff, Parr, et al., 1981 | LLK |
10.05 | PE | Mines and Thompson, 1973 | LLK |
10.05 | PE | Bieri, Asbrink, et al., 1982 | Vertical value; LBLHLM |
10.34 | PE | Zverev and Ermolaeva, 1981 | Vertical value; LLK |
10.20 | PE | Worrell, 1974 | Vertical value; LLK |
10.34 | PE | Schmidt and Schweig, 1973 | Vertical value; LLK |
Appearance energy determinations
Ion | AE (eV) | Other Products | Method | Reference | Comment |
---|---|---|---|---|---|
C3H3+ | 13.37 ± 0.08 | ? | PI | Buff, Parr, et al., 1981 | LLK |
C3H5+ | 11.04 | Cl | PI | Traeger, 1984 | LBLHLM |
C3H5+ | 11.05 ± 0.04 | Cl | PI | Buff, Parr, et al., 1981 | LLK |
De-protonation reactions
C3H4Cl- + =
By formula: C3H4Cl- + H+ = C3H5Cl
Quantity | Value | Units | Method | Reference | Comment |
---|---|---|---|---|---|
ΔrH° | 1590. ± 17. | kJ/mol | G+TS | Dahlke and Kass, 1991 | gas phase; Between MeOH, EtOH. Reprotonation site uncertain; B |
ΔrH° | 1571. ± 8.8 | kJ/mol | G+TS | Poutsma, Nash, et al., 1997 | gas phase; Between iPrOH, HF, near tBuOH; B |
Quantity | Value | Units | Method | Reference | Comment |
ΔrG° | 1559. ± 17. | kJ/mol | IMRB | Dahlke and Kass, 1991 | gas phase; Between MeOH, EtOH. Reprotonation site uncertain; B |
ΔrG° | 1540. ± 8.4 | kJ/mol | IMRB | Poutsma, Nash, et al., 1997 | gas phase; Between iPrOH, HF, near tBuOH; B |

Reaction thermochemistry data

Data compiled as indicated in comments:
B - John E. Bartmess
ALS - Hussein Y. Afeefy, Joel F. Liebman, and Stephen E. Stein
Individual Reactions
C3H4Cl- + =
By formula: C3H4Cl- + H+ = C3H5Cl
Quantity | Value | Units | Method | Reference | Comment |
---|---|---|---|---|---|
ΔrH° | 379.9 ± 4.1 | kcal/mol | G+TS | Dahlke and Kass, 1991 | gas phase; Between MeOH, EtOH. Reprotonation site uncertain; B |
ΔrH° | 375.4 ± 2.1 | kcal/mol | G+TS | Poutsma, Nash, et al., 1997 | gas phase; Between iPrOH, HF, near tBuOH; B |
Quantity | Value | Units | Method | Reference | Comment |
ΔrG° | 372.5 ± 4.0 | kcal/mol | IMRB | Dahlke and Kass, 1991 | gas phase; Between MeOH, EtOH. Reprotonation site uncertain; B |
ΔrG° | 368.0 ± 2.0 | kcal/mol | IMRB | Poutsma, Nash, et al., 1997 | gas phase; Between iPrOH, HF, near tBuOH; B |
By formula: C3H5Cl + 2C2H7N = C5H11N + C2H8ClN
Quantity | Value | Units | Method | Reference | Comment |
---|---|---|---|---|---|
ΔrH° | -19.74 ± 0.09 | kcal/mol | Cm | Beldie, Aelenei, et al., 1982 | liquid phase; ALS |
By formula: C3H5Cl = C3H5Cl
Quantity | Value | Units | Method | Reference | Comment |
---|---|---|---|---|---|
ΔrH° | -2.38 ± 0.10 | kcal/mol | Ciso | Abell and Adolf, 1969 | gas phase; HBr catalyst; ALS |
By formula: C3H5Cl = C3H5Cl
Quantity | Value | Units | Method | Reference | Comment |
---|---|---|---|---|---|
ΔrH° | 3.5 ± 0.2 | kcal/mol | Eqk | Alfassi, Golden, et al., 1973 | liquid phase; ALS |
By formula: C3H5Cl = C3H5Cl
Quantity | Value | Units | Method | Reference | Comment |
---|---|---|---|---|---|
ΔrH° | 2.6 ± 0.2 | kcal/mol | Eqk | Alfassi, Golden, et al., 1973 | liquid phase; ALS |

Van Den Dool and Kratz RI, non-polar column, temperature ramp

Column type | Active phase | I | Reference | Comment |
---|---|---|---|---|
Capillary | Petrocol DH | 516. | White, Hackett, et al., 1992 | 100. m/0.25 mm/0.5 μm, He, 1. K/min; Tstart: 30. C; Tend: 220. C |

Normal alkane RI, non-polar column, isothermal

Column type | Active phase | Temperature (C) | I | Reference | Comment |
---|---|---|---|---|---|
Packed | Synachrom | 150. | 495. | Dufka, Malinsky, et al., 1971 | Helium, Synachrom (60-80 mesh); Column length: 1.5 m |
Packed | Synachrom | 150. | 500. | Dufka, Malinsky, et al., 1971 | Helium, Synachrom (60-80 mesh); Column length: 1.5 m |

Normal alkane RI, non-polar column, temperature ramp

Column type | Active phase | I | Reference | Comment |
---|---|---|---|---|
Capillary | OV-101 | 526. | Zenkevich, 2005 | 25. m/0.20 mm/0.10 μm, N2/He, 6. K/min; Tstart: 50. C; Tend: 250. C |
Capillary | SE-54 | 498. | Huang, Liang, et al., 1996 | 36. m/0.25 mm/0.25 μm, 5. K/min; Tstart: 35. C; Tend: 240. C |

Normal alkane RI, non-polar column, custom temperature program

Column type | Active phase | I | Reference | Comment |
---|---|---|---|---|
Capillary | Polydimethyl siloxanes | 526. | Zenkevich and Chupalov, 1996 | Program: not specified |

Gas phase thermochemistry data

Data compiled by: Hussein Y. Afeefy, Joel F. Liebman, and Stephen E. Stein
Quantity | Value | Units | Method | Reference | Comment |
---|---|---|---|---|---|
ΔfH°gas | -1.3 | kcal/mol | Ion | Traeger, 1984 |

References

von Reis, 1881
von Reis, M.A.,
Die specifische Wärme flüssiger organischer Verbindungen und ihre Beziehung zu deren Moleculargewicht,
Ann. Physik [3], 1881, 13, 447-464. [all data]
Timmermans, 1952
Timmermans, J.,
Freezing points of organic compounds. VVI New determinations.,
Bull. Soc. Chim. Belg., 1952, 61, 393. [all data]
Timmermans, 1911
Timmermans, J.,
Researches on the freezing point of organic liquid compounds,
Bull. Soc. Chim. Belg., 1911, 25, 300. [all data]
Djkyj, Paulech, et al., 1960
Djkyj, J.; Paulech, J.; Seprakova, M.,
Chem. Zvesti, 1960, 14, 327. [all data]
Stephenson and Malanowski, 1987
Stephenson, Richard M.; Malanowski, Stanislaw,
Handbook of the Thermodynamics of Organic Compounds, 1987, https://doi.org/10.1007/978-94-009-3173-2
. [all data]
Ioffe and Yamp'olskaya, 1944
Ioffe, I.I.; Yamp'olskaya, E.S.,
Zh. Prikl. Khim. (S.-Peterburg), 1944, 17, 527. [all data]
Boublik, Fried, et al., 1984
Boublik, T.; Fried, V.; Hala, E.,
The Vapour Pressures of Pure Substances: Selected Values of the Temperature Dependence of the Vapour Pressures of Some Pure Substances in the Normal and Low Pressure Region, 2nd ed., Elsevier, New York, 1984, 972. [all data]
Joffe and Jampolskaja, 1944
Joffe, J.J.; Jampolskaja, E.S.,
On the Pressure of the Saturated Vapour of Allyl Chloride,
Zh. Prikl. Khim. (Leningrad), 1944, 17, 527-528. [all data]
Traeger, 1984
Traeger, J.C.,
A study of the allyl cation thermochemistry by photoionization mass spectrometry,
Int. J. Mass Spectrom. Ion Processes, 1984, 58, 259. [all data]
Bieri, Asbrink, et al., 1982
Bieri, G.; Asbrink, L.; Von Niessen, W.,
30.4-nm He(II) photoelectron spectra of organic molecules,
J. Electron Spectrosc. Relat. Phenom., 1982, 27, 129. [all data]
Buff, Parr, et al., 1981
Buff, R.D.; Parr, A.C.; Jason, A.J.,
The photoionization of allyl chloride from onset to 20 eV,
Int. J. Mass Spectrom. Ion Phys., 1981, 40, 31. [all data]
Mines and Thompson, 1973
Mines, G.W.; Thompson, H.W.,
Photoelectron spectra of vinyl and allyl halides,
Spectrochim. Acta Part A, 1973, 29, 1377. [all data]
Zverev and Ermolaeva, 1981
Zverev, V.V.; Ermolaeva, L.V.,
Ionization potentials and intramolecular charge transfer. II. The photoelectron spectrum and electronic structure of trichloromethylbenzene,
Zh. Strukt. Khim., 1981, 22, 22. [all data]
Worrell, 1974
Worrell, C.W.,
The photoelectron and absorption spectra of allyl halides,
J. Electron Spectrosc. Relat. Phenom., 1974, 3, 359. [all data]
Schmidt and Schweig, 1973
Schmidt, H.; Schweig, A.,
Semiquantitative proof of hyperconjugation,
Angew. Chem. Int. Ed. Engl., 1973, 12, 307. [all data]
Dahlke and Kass, 1991
Dahlke, G.D.; Kass, S.R.,
Substituent Effects in the Gas Phase - 1-Substituted Allyl Anions,
J. Am. Chem. Soc., 1991, 113, 15, 5566, https://doi.org/10.1021/ja00015a008
. [all data]
Poutsma, Nash, et al., 1997
Poutsma, J.C.; Nash, J.J.; Paulino, J.A.; Squires, R.R.,
Absolute Heats of Formation of Phenylcarbene and Vinylcarbene,
J. Am. Chem. Soc., 1997, 119, 20, 4686, https://doi.org/10.1021/ja963918s
. [all data]