Ethane, 1-bromo-2-chloro-
- Formula: C2H4BrCl
- Molecular weight: 143.410
- IUPAC Standard InChIKey: IBYHHJPAARCAIE-UHFFFAOYSA-N
- CAS Registry Number: 107-04-0
- Chemical structure:
View 3d structure (requires JavaScript / HTML 5) - Other names: β-Chloroethyl bromide; s-Chlorobromoethane; Ethylene chlorobromide; 1-Bromo-2-chloroethane; 1-Chloro-2-bromoethane; 1,2-Bromochloroethane; 1,2-Chlorobromoethane; 2-Bromo-1-chloroethane; 2-Bromoethyl chloride; 2-Chloroethyl bromide; CH2BrCH2Cl; sym-Chlorobromoethane; NSC 60186

Condensed phase thermochemistry data

Data compiled by: Eugene S. Domalski and Elizabeth D. Hearing
Constant pressure heat capacity of liquid
Cp,liquid (cal/mol*K) | Temperature (K) | Reference | Comment |
---|---|---|---|
31.09 | 300. | Railing, 1939 | T = 90 to 320 K. Data graphically only. Value read from graph. |

Phase change data

Data compiled as indicated in comments:
BS - Robert L. Brown and Stephen E. Stein
TRC - Thermodynamics Research Center, NIST Boulder Laboratories, Chris Muzny director
ALS - Hussein Y. Afeefy, Joel F. Liebman, and Stephen E. Stein
DH - Eugene S. Domalski and Elizabeth D. Hearing
AC - William E. Acree, Jr., James S. Chickos
CAL - James S. Chickos, William E. Acree, Jr., Joel F. Liebman, Students of Chem 202 (Introduction to the Literature of Chemistry), University of Missouri -- St. Louis
Quantity | Value | Units | Method | Reference | Comment |
---|---|---|---|---|---|
Tboil | 390. ± 30. | K | AVG | N/A | Average of 7 values; Individual data points |
Quantity | Value | Units | Method | Reference | Comment |
Tfus | 256.4 | K | N/A | Buckingham and Donaghy, 1982 | BS |
Tfus | 256.5 | K | N/A | Railing, 1939, 2 | Crystal phase 1 phase; Uncertainty assigned by TRC = 0.2 K; TRC |
Tfus | 198.8 | K | N/A | Timmermans, 1922 | Uncertainty assigned by TRC = 0.4 K; TRC |
Quantity | Value | Units | Method | Reference | Comment |
ΔvapH° | 9.113 ± 0.01 | kcal/mol | C | Wadso, 1968 | ALS |
Enthalpy of vaporization
ΔvapH (kcal/mol) | Temperature (K) | Method | Reference | Comment |
---|---|---|---|---|
9.0966 | 379.8 | N/A | Svoboda, Kubes, et al., 1992 | DH |
8.99 ± 0.02 | 308. | C | Svoboda, Kubes, et al., 1992 | AC |
8.91 ± 0.02 | 315. | C | Svoboda, Kubes, et al., 1992 | AC |
8.82 ± 0.02 | 323. | C | Svoboda, Kubes, et al., 1992 | AC |
8.75 ± 0.02 | 330. | C | Svoboda, Kubes, et al., 1992 | AC |
8.70 ± 0.02 | 338. | C | Svoboda, Kubes, et al., 1992 | AC |
9.44 | 244. to 379. | N/A | Stull, 1947 | AC |
Antoine Equation Parameters
log10(P) = A − (B / (T + C))
P = vapor pressure (atm)
T = temperature (K)
View plot Requires a JavaScript / HTML 5 canvas capable browser.
Temperature (K) | A | B | C | Reference | Comment |
---|---|---|---|---|---|
244.4 to 379.8 | 4.3897 | 1500.797 | -37.88 | Stull, 1947 | Coefficents calculated by NIST from author's data. |
Enthalpy of fusion
ΔfusH (kcal/mol) | Temperature (K) | Reference | Comment |
---|---|---|---|
2.30 | 256.4 | Domalski and Hearing, 1996 | AC |
Entropy of fusion
ΔfusS (cal/mol*K) | Temperature (K) | Reference | Comment |
---|---|---|---|
4.099 | 182. | Domalski and Hearing, 1996 | CAL |
8.970 | 256.4 |
Enthalpy of phase transition
ΔHtrs (kcal/mol) | Temperature (K) | Initial Phase | Final Phase | Reference | Comment |
---|---|---|---|---|---|
0.7409 | 182. | crystaline, II | crystaline, I | Railing, 1939 | DH |
2.300 | 256.4 | crystaline, I | liquid | Railing, 1939 | DH |
Entropy of phase transition
ΔStrs (cal/mol*K) | Temperature (K) | Initial Phase | Final Phase | Reference | Comment |
---|---|---|---|---|---|
4.06 | 182. | crystaline, II, Lambda | crystaline, I, type transition | Railing, 1939 | DH |
8.96 | 256.4 | crystaline, I | liquid | Railing, 1939 | DH |

Henry's Law data

Data compiled by: Rolf Sander
Henry's Law constant (water solution)
kH(T) = k°H exp(d(ln(kH))/d(1/T) ((1/T) - 1/(298.15 K)))
k°H = Henry's law constant for solubility in water at 298.15 K (mol/(kg*bar))
d(ln(kH))/d(1/T) = Temperature dependence constant (K)
k°H (mol/(kg*bar)) | d(ln(kH))/d(1/T) (K) | Method | Reference |
---|---|---|---|
1.1 | V | N/A |

Gas phase ion energetics data

Data evaluated as indicated in comments:
L - Sharon G. Lias
Data compiled as indicated in comments:
LBLHLM - Sharon G. Lias, John E. Bartmess, Joel F. Liebman, John L. Holmes, Rhoda D. Levin, and W. Gary Mallard
LLK - Sharon G. Lias, Rhoda D. Levin, and Sherif A. Kafafi
RDSH - Henry M. Rosenstock, Keith Draxl, Bruce W. Steiner, and John T. Herron
Quantity | Value | Units | Method | Reference | Comment |
---|---|---|---|---|---|
IE (evaluated) | 10.57 ± 0.05 | eV | N/A | N/A | L |
Ionization energy determinations
IE (eV) | Method | Reference | Comment |
---|---|---|---|
10.55 | PI | Berman, Anicich, et al., 1979 | LLK |
10.52 | PE | Berman, Anicich, et al., 1979 | LLK |
10.63 ± 0.03 | PI | Watanabe, Nakayama, et al., 1962 | RDSH |
10.63 | PE | Ohno, Imai, et al., 1985 | Vertical value; LBLHLM |
10.5 ± 0.1 | PE | Carnovale, Gan, et al., 1979 | Vertical value; Gauche conformer; LLK |
10.7 ± 0.1 | PE | Carnovale, Gan, et al., 1979 | Vertical value; Trans conformer; LLK |
10.65 ± 0.01 | PE | Chau and McDowell, 1976 | Vertical value; LLK |
Appearance energy determinations
Ion | AE (eV) | Other Products | Method | Reference | Comment |
---|---|---|---|---|---|
C2H4Br+ | 10.89 | ? | PI | Berman, Anicich, et al., 1979 | LLK |
C2H4Cl+ | 10.72 | ? | PI | Berman, Anicich, et al., 1979 | LLK |

Vibrational and/or electronic energy levels

Data compiled by: Takehiko Shimanouchi
Trans form Symmetry: Cs Symmetry Number σ = 1
Sym. | No | Approximate | Selected Freq. | Infrared | Raman | Comments | ||||
---|---|---|---|---|---|---|---|---|---|---|
Species | type of mode | Value | Rating | Value | Phase | Value | Phase | |||
a' | 1 | CH2 s-str | 2960 | D | 2960 | liq. | SF(ν2, )gauche ν3, gauche ν4 | |||
a' | 2 | CH2 s-str | 2960 | D | 2960 | liq. | SF(ν1, )gauche ν3, gauche ν4 | |||
a' | 3 | CH2 scis | 1446 | D | 1446 S | sln. | ||||
a' | 4 | CH2 scis | 1444 | C | 1444 | liq. | ||||
a' | 5 | CH2 wag | 1284 | C | 1284 M | sln. | 1284 p | liq. | ||
a' | 6 | CH2 wag | 1203 | C | 1203 S | sln. | 1203 | liq. | ||
a' | 7 | CC str | 1052 | C | 1056 M | sln. | 1052 dp | liq. | ||
a' | 8 | CCl str | 726 | C | 722 S | sln. | 726 p | liq. | ||
a' | 9 | CBr str | 630 | C | 630 S | sln. | 630 | liq. | ||
a' | 10 | CCCl deform | 251 | C | 251 p | liq. | SF()gauche ν17 | |||
a' | 11 | CCBr deform | 202 | C | 202.0 | solid solid | 210 | liq. | ||
a | 12 | CH2 a-str | 3010 | D | 3010 | liq. | SF(ν13, )gauche ν1, gauche ν2 | |||
a | 13 | CH2 a-str | 3010 | D | 3010 | liq. | SF(ν12, )gauche ν1, gauche ν2 | |||
a | 14 | CH2 twist | 1259 | C | 1258 VW | sln. | 1259 | liq. | ||
a | 15 | CH2 twist | 1111 | D | 1111 M | sln. | ||||
a | 16 | CH2 rock | 961 | C | 961 VW | sln. | 961 | liq. | ||
a | 17 | CH2 rock | 763 | D | 763 M | sln. | ||||
a | 18 | Torsion | 123 | C | 123 | solid solid | ||||
Source: Shimanouchi, 1972
Gauche form Symmetry: C1 Symmetry Number σ = 1
Sym. | No | Approximate | Selected Freq. | Infrared | Raman | Comments | ||||
---|---|---|---|---|---|---|---|---|---|---|
Species | type of mode | Value | Rating | Value | Phase | Value | Phase | |||
a | 1 | CH2 a-str | 3010 | D | 3010 | liq. | SF(ν2 )trans ν12, trans ν13 | |||
a | 2 | CH2 a-str | 3010 | D | 3010 | liq. | SF(ν1 )trans ν12, trans ν13 | |||
a | 3 | CH2 s-str | 2960 | D | 2960 | liq. | SF(ν4, )trans ν1, trans ν2 | |||
a | 4 | CH2 s-str | 2960 | D | 2960 | liq. | SF(ν3, )trans ν1, trans ν2 | |||
a | 5 | CH2 scis | 1428 | D | 1428 S | liq. | 1421 | liq. | OV(ν6) | |
a | 6 | CH2 scis | 1428 | D | 1428 S | liq. | 1421 | liq. | OV(ν5) | |
a | 7 | CH2 wag | 1299 | C | 1299 S | liq. | 1299 | liq. | ||
a | 8 | CH2 wag | 1260 | C | 1260 S | liq. | 1259 | liq. | ||
a | 9 | CH2 twist | 1190 | D | 1190 M | liq. | 1189 p | liq. | ||
a | 10 | CH2 twist | 1127 | C | 1127 M | liq. | 1128 dp | liq. | ||
a | 11 | CC str | 1025 | C | 1025 M | liq. | 1023 | liq. | ||
a | 12 | CH2 rock | 923 | C | 923 S | liq. | 919 p | liq. | ||
a | 13 | CH2 rock | 856 | C | 856 S | liq. | 852 | liq. | ||
a | 14 | CCl str | 664 | C | 664 S | liq. | 665 | liq. | ||
a | 15 | CBr str | 571 | C | 571 S | liq. | 568 p | liq. | ||
a | 16 | CCCl deform | 385 | C | 385 dp | liq. | ||||
a | 17 | CCBr deform | 251 | D | 251 | liq. | SF()trans ν10 | |||
a | 18 | Torsion | 107 | D | 107 | liq. | ||||
Source: Shimanouchi, 1972

Kovats' RI, non-polar column, isothermal

Column type | Active phase | Temperature (C) | I | Reference | Comment |
---|---|---|---|---|---|
Packed | OV-1 | 100. | 716. | Castello and Gerbino, 1988 | He, Chromosorb W DMCS; Column length: 3. m |
Packed | OV-1 | 125. | 723. | Castello and Gerbino, 1988 | He, Chromosorb W DMCS; Column length: 3. m |
Packed | OV-1 | 75. | 708. | Castello and Gerbino, 1988 | He, Chromosorb W DMCS; Column length: 3. m |
Packed | Squalane | 27. | 681. | Hively and Hinton, 1968 | He, Chromosorb P; Column length: 15. m; Column diameter: 0.25 mm |
Packed | Squalane | 49. | 688. | Hively and Hinton, 1968 | He, Chromosorb P; Column length: 15. m; Column diameter: 0.25 mm |
Packed | Squalane | 67. | 693. | Hively and Hinton, 1968 | He, Chromosorb P; Column length: 15. m; Column diameter: 0.25 mm |
Packed | Squalane | 86. | 698. | Hively and Hinton, 1968 | He, Chromosorb P; Column length: 15. m; Column diameter: 0.25 mm |

Kovats' RI, polar column, isothermal

Column type | Active phase | Temperature (C) | I | Reference | Comment |
---|---|---|---|---|---|
Packed | SP-1000 | 100. | 1186.26 | Castello and Gerbino, 1988 | He, Chromosorb W DMCS; Column length: 3. m |
Packed | SP-1000 | 125. | 1192.67 | Castello and Gerbino, 1988 | He, Chromosorb W DMCS; Column length: 3. m |
Packed | SP-1000 | 75. | 1174.97 | Castello and Gerbino, 1988 | He, Chromosorb W DMCS; Column length: 3. m |

Van Den Dool and Kratz RI, non-polar column, temperature ramp

Column type | Active phase | I | Reference | Comment |
---|---|---|---|---|
Capillary | SE-54 | 729. | Weber, 1986 | 25. m/0.31 mm/0.17 μm, H2, 2. K/min; Tstart: 35. C |

Normal alkane RI, non-polar column, custom temperature program

Column type | Active phase | I | Reference | Comment |
---|---|---|---|---|
Capillary | OV-1, SE-30, Methyl silicone, SP-2100, OV-101, DB-1, etc. | 704. | Waggott and Davies, 1984 | Hydrogen; Column length: 50. m; Column diameter: 0.32 mm; Program: not specified |
Packed | Squalane | 725.2 | Keiko, Prokop'ev, et al., 1972 | Program: not specified |

References

Railing, 1939
Railing, W.E.,
The specific heat of some ethylene halides,
J. Am. Chem. Soc., 1939, 61, 3349-3353. [all data]
Buckingham and Donaghy, 1982
Buckingham, J.; Donaghy, S.M.,
Dictionary of Organic Compounds: Fifth Edition, Chapman and Hall, New York, 1982, 1. [all data]
Railing, 1939, 2
Railing, W.E.,
The Specific Heat of Some Ethylene Halides,
J. Am. Chem. Soc., 1939, 61, 3349. [all data]
Timmermans, 1922
Timmermans, J.,
Investigation of the Freezing Point of Organic Substances VII,
Bull. Soc. Chim. Belg., 1922, 31, 389. [all data]
Wadso, 1968
Wadso, I.,
Heats of vaporization of organic compounds II. Chlorides, bromides, and iodides,
Acta Chem. Scand., 1968, 22, 2438. [all data]
Svoboda, Kubes, et al., 1992
Svoboda, V.; Kubes, V.; Basarova, P.,
Enthalpies of vaporization and cohesive energies of 1,1,2,2-tetrachloro-1,2-difluoroethane, 1,2-dibromoethane, 1-bromo-2-chloroethane, 1,3-dibromo-propane, and 1,4-dibromo-2,3-dichloro-1,1,2,3,4,4-hexafluorobutane,
J. Chem. Thermodyn., 1992, 24, 555-558. [all data]
Stull, 1947
Stull, Daniel R.,
Vapor Pressure of Pure Substances. Organic and Inorganic Compounds,
Ind. Eng. Chem., 1947, 39, 4, 517-540, https://doi.org/10.1021/ie50448a022
. [all data]
Domalski and Hearing, 1996
Domalski, Eugene S.; Hearing, Elizabeth D.,
Heat Capacities and Entropies of Organic Compounds in the Condensed Phase. Volume III,
J. Phys. Chem. Ref. Data, 1996, 25, 1, 1, https://doi.org/10.1063/1.555985
. [all data]
Berman, Anicich, et al., 1979
Berman, D.W.; Anicich, V.; Beauchamp, J.L.,
Stabilities of isomeric halonium ions C2H4X+ (X = Cl, Br) by photoionization mass spectrometry iand on cyclotron resonance spectroscopy. General considerations of the relative stabilities of cyclic and acyclic isomeric onium ions,
J. Am. Chem. Soc., 1979, 101, 1239. [all data]
Watanabe, Nakayama, et al., 1962
Watanabe, K.; Nakayama, T.; Mottl, J.,
Ionization potentials of some molecules,
J. Quant. Spectry. Radiative Transfer, 1962, 2, 369. [all data]
Ohno, Imai, et al., 1985
Ohno, K.; Imai, K.; Harada, Y.,
Variations in reactivity of lone-pair electrons due to intramolecular hydrogen bonding as observed by penning ionization electron spectroscopy,
J. Am. Chem. Soc., 1985, 107, 8078. [all data]
Carnovale, Gan, et al., 1979
Carnovale, F.; Gan, T.H.; Peel, J.B.,
Photoelectron spectra of the gauche and trans conformers of 1,2-bromochloroethane,
J. Electron Spectrosc. Relat. Phenom., 1979, 16, 87. [all data]
Chau and McDowell, 1976
Chau, F.T.; McDowell, C.A.,
Photoelectron spectra of 1,2-dibromo-1,1-difluoroethane, 1,2-bromochloroethane, and 1,2-dichloro-, 1,2-dibromo-, and 1,2-diiodotetrafluoroethane,
J. Phys. Chem., 1976, 80, 2923. [all data]