Propyl mercaptan
- Formula: C3H8S
- Molecular weight: 76.161
- IUPAC Standard InChIKey: SUVIGLJNEAMWEG-UHFFFAOYSA-N
- CAS Registry Number: 107-03-9
- Chemical structure:
View 3d structure (requires JavaScript / HTML 5) - Other names: 1-Propanethiol; n-Propyl mercaptan; Propanethiol; 1-Propyl mercaptan; n-C3H7SH; Propane-1-thiol; 1-Mercaptopropane; 1-Propylthiol; n-Propylthiol; Propylthiol

Phase change data

Data compiled as indicated in comments:
BS - Robert L. Brown and Stephen E. Stein
TRC - Thermodynamics Research Center, NIST Boulder Laboratories, Chris Muzny director
AC - William E. Acree, Jr., James S. Chickos
ALS - Hussein Y. Afeefy, Joel F. Liebman, and Stephen E. Stein
DRB - Donald R. Burgess, Jr.
CAL - James S. Chickos, William E. Acree, Jr., Joel F. Liebman, Students of Chem 202 (Introduction to the Literature of Chemistry), University of Missouri -- St. Louis
DH - Eugene S. Domalski and Elizabeth D. Hearing
Quantity | Value | Units | Method | Reference | Comment |
---|---|---|---|---|---|
Tboil | 340.9 ± 0.7 | K | AVG | N/A | Average of 18 out of 21 values; Individual data points |
Quantity | Value | Units | Method | Reference | Comment |
Tfus | 160. ± 1. | K | AVG | N/A | Average of 6 values; Individual data points |
Quantity | Value | Units | Method | Reference | Comment |
Ttriple | 159.9800 | K | N/A | Pennington, Scott, et al., 1956 | Crystal phase 1 phase; Uncertainty assigned by TRC = 0.05 K; TRC |
Ttriple | 159.9900 | K | N/A | Pennington, Scott, et al., 1956 | Crystal phase 1 phase; Uncertainty assigned by TRC = 0.03 K; TRC |
Ttriple | 160.00 | K | N/A | Anonymous, 1954 | Uncertainty assigned by TRC = 0.07 K; TRC |
Quantity | Value | Units | Method | Reference | Comment |
Tc | 536.6 | K | N/A | Teja and Anselme, 1990 | Uncertainty assigned by TRC = 0.4 K; TRC |
Tc | 535.6 | K | N/A | Majer and Svoboda, 1985 | |
Quantity | Value | Units | Method | Reference | Comment |
ρc | 3.49 | mol/l | N/A | Teja and Anselme, 1990 | Uncertainty assigned by TRC = 0.1 mol/l; TRC |
Quantity | Value | Units | Method | Reference | Comment |
ΔvapH° | 32.05 | kJ/mol | N/A | Majer and Svoboda, 1985 | |
ΔvapH° | 31.9 | kJ/mol | N/A | Reid, 1972 | AC |
ΔvapH° | 31.99 | kJ/mol | V | Pennington, Scott, et al., 1956, 2 | ALS |
ΔvapH° | 32.0 | kJ/mol | N/A | Hubbard and Waddington, 1954 | DRB |
Enthalpy of vaporization
ΔvapH (kJ/mol) | Temperature (K) | Method | Reference | Comment |
---|---|---|---|---|
29.54 | 340.9 | N/A | Majer and Svoboda, 1985 | |
33.7 | 269. | N/A | Dykyj, Svoboda, et al., 1999 | Based on data from 254. to 364. K.; AC |
31.8 | 312. | A,EB | Stephenson and Malanowski, 1987 | Based on data from 297. to 375. K. See also Pennington, Scott, et al., 1956, 3, Osborn and Douslin, 1966, and Hubbard and Waddington, 2010.; AC |
31.6 ± 0.1 | 303. | C | Pennington, Scott, et al., 1956, 3 | AC |
30.7 ± 0.1 | 320. | C | Pennington, Scott, et al., 1956, 3 | AC |
29.5 ± 0.1 | 341. | C | Pennington, Scott, et al., 1956, 3 | AC |
31.5 | 312. | N/A | Taylor and Layng, 1933 | Based on data from 284. to 340. K.; AC |
Enthalpy of vaporization
ΔvapH =
A exp(-βTr) (1 − Tr)β
ΔvapH =
Enthalpy of vaporization (at saturation pressure)
(kJ/mol)
Tr = reduced temperature (T / Tc)
View plot Requires a JavaScript / HTML 5 canvas capable browser.
Temperature (K) | A (kJ/mol) | β | Tc (K) | Reference | Comment |
---|---|---|---|---|---|
303. to 341. | 46.5 | 0.2753 | 535.6 | Majer and Svoboda, 1985 |
Antoine Equation Parameters
log10(P) = A − (B / (T + C))
P = vapor pressure (bar)
T = temperature (K)
View plot Requires a JavaScript / HTML 5 canvas capable browser.
Temperature (K) | A | B | C | Reference | Comment |
---|---|---|---|---|---|
297.42 to 375.24 | 4.05353 | 1183.392 | -48.516 | Pennington, Scott, et al., 1956, 3 | Coefficents calculated by NIST from author's data. |
Enthalpy of fusion
ΔfusH (kJ/mol) | Temperature (K) | Reference | Comment |
---|---|---|---|
5.48 | 160. | Domalski and Hearing, 1996 | AC |
Entropy of fusion
ΔfusS (J/mol*K) | Temperature (K) | Reference | Comment |
---|---|---|---|
27.95 | 142.1 | Domalski and Hearing, 1996 | CAL |
34.23 | 160. |
Enthalpy of phase transition
ΔHtrs (kJ/mol) | Temperature (K) | Initial Phase | Final Phase | Reference | Comment |
---|---|---|---|---|---|
3.9710 | 142.10 | crystaline, II | crystaline, I | Pennington, Scott, et al., 1956, 3 | DH |
5.4769 | 160.00 | crystaline, I | liquid | Pennington, Scott, et al., 1956, 3 | DH |
Entropy of phase transition
ΔStrs (J/mol*K) | Temperature (K) | Initial Phase | Final Phase | Reference | Comment |
---|---|---|---|---|---|
27.95 | 142.10 | crystaline, II | crystaline, I | Pennington, Scott, et al., 1956, 3 | DH |
34.23 | 160.00 | crystaline, I | liquid | Pennington, Scott, et al., 1956, 3 | DH |

Reaction thermochemistry data

Data compiled as indicated in comments:
M - Michael M. Meot-Ner (Mautner) and Sharon G. Lias
B - John E. Bartmess
ALS - Hussein Y. Afeefy, Joel F. Liebman, and Stephen E. Stein
Individual Reactions
By formula: C3H9Sn+ + C3H8S = (C3H9Sn+ • C3H8S)
Quantity | Value | Units | Method | Reference | Comment |
---|---|---|---|---|---|
ΔrH° | 143. | kJ/mol | PHPMS | Stone and Splinter, 1984 | gas phase; switching reaction((CH3)3Sn+)CH3OH, Entropy change calculated or estimated; M |
Quantity | Value | Units | Method | Reference | Comment |
ΔrS° | 135. | J/mol*K | N/A | Stone and Splinter, 1984 | gas phase; switching reaction((CH3)3Sn+)CH3OH, Entropy change calculated or estimated; M |
Free energy of reaction
ΔrG° (kJ/mol) | T (K) | Method | Reference | Comment |
---|---|---|---|---|
72.4 | 525. | PHPMS | Stone and Splinter, 1984 | gas phase; switching reaction((CH3)3Sn+)CH3OH, Entropy change calculated or estimated; M |
C3H7S- + =
By formula: C3H7S- + H+ = C3H8S
Quantity | Value | Units | Method | Reference | Comment |
---|---|---|---|---|---|
ΔrH° | 1482. ± 9.2 | kJ/mol | G+TS | Bartmess, Scott, et al., 1979 | gas phase; value altered from reference due to change in acidity scale; B |
Quantity | Value | Units | Method | Reference | Comment |
ΔrG° | 1456. ± 8.4 | kJ/mol | IMRE | Bartmess, Scott, et al., 1979 | gas phase; value altered from reference due to change in acidity scale; B |
By formula: 2C3H8S + I2 = 2HI + C6H14S2
Quantity | Value | Units | Method | Reference | Comment |
---|---|---|---|---|---|
ΔrH° | -124.9 | kJ/mol | Cm | Sunner, 1955 | liquid phase; solvent: Ethanol/water(90/10); ALS |
By formula: C5H10OS + H2O = C3H8S + C2H4O2
Quantity | Value | Units | Method | Reference | Comment |
---|---|---|---|---|---|
ΔrH° | -3.9 ± 0.3 | kJ/mol | Cm | Wadso, 1957 | liquid phase; Heat of hydrolysis; ALS |

Gas phase ion energetics data

Data evaluated as indicated in comments:
HL - Edward P. Hunter and Sharon G. Lias
L - Sharon G. Lias
Data compiled as indicated in comments:
B - John E. Bartmess
LLK - Sharon G. Lias, Rhoda D. Levin, and Sherif A. Kafafi
RDSH - Henry M. Rosenstock, Keith Draxl, Bruce W. Steiner, and John T. Herron
Quantity | Value | Units | Method | Reference | Comment |
---|---|---|---|---|---|
IE (evaluated) | 9.20 ± 0.01 | eV | N/A | N/A | L |
Quantity | Value | Units | Method | Reference | Comment |
Proton affinity (review) | 794.9 | kJ/mol | N/A | Hunter and Lias, 1998 | HL |
Quantity | Value | Units | Method | Reference | Comment |
Gas basicity | 763.6 | kJ/mol | N/A | Hunter and Lias, 1998 | HL |
Ionization energy determinations
IE (eV) | Method | Reference | Comment |
---|---|---|---|
9.21 | PE | Kimura, Katsumata, et al., 1981 | LLK |
9.19 | PE | Ogata, Onizuka, et al., 1973 | LLK |
9.195 ± 0.005 | PI | Watanabe, Nakayama, et al., 1962 | RDSH |
De-protonation reactions
C3H7S- + =
By formula: C3H7S- + H+ = C3H8S
Quantity | Value | Units | Method | Reference | Comment |
---|---|---|---|---|---|
ΔrH° | 1482. ± 9.2 | kJ/mol | G+TS | Bartmess, Scott, et al., 1979 | gas phase; value altered from reference due to change in acidity scale; B |
Quantity | Value | Units | Method | Reference | Comment |
ΔrG° | 1456. ± 8.4 | kJ/mol | IMRE | Bartmess, Scott, et al., 1979 | gas phase; value altered from reference due to change in acidity scale; B |

Ion clustering data

Data compiled by: Michael M. Meot-Ner (Mautner) and Sharon G. Lias
Clustering reactions
By formula: C3H9Sn+ + C3H8S = (C3H9Sn+ • C3H8S)
Quantity | Value | Units | Method | Reference | Comment |
---|---|---|---|---|---|
ΔrH° | 143. | kJ/mol | PHPMS | Stone and Splinter, 1984 | gas phase; switching reaction((CH3)3Sn+)CH3OH, Entropy change calculated or estimated |
Quantity | Value | Units | Method | Reference | Comment |
ΔrS° | 135. | J/mol*K | N/A | Stone and Splinter, 1984 | gas phase; switching reaction((CH3)3Sn+)CH3OH, Entropy change calculated or estimated |
Free energy of reaction
ΔrG° (kJ/mol) | T (K) | Method | Reference | Comment |
---|---|---|---|---|
72.4 | 525. | PHPMS | Stone and Splinter, 1984 | gas phase; switching reaction((CH3)3Sn+)CH3OH, Entropy change calculated or estimated |

Gas phase thermochemistry data

Data compiled by: Hussein Y. Afeefy, Joel F. Liebman, and Stephen E. Stein
Quantity | Value | Units | Method | Reference | Comment |
---|---|---|---|---|---|
ΔfH°gas | -16.39 ± 0.15 | kcal/mol | Ccr | Hubbard and Waddington, 1954 | Heat of combustion calculated author's U=-675.26 |

Condensed phase thermochemistry data

Data compiled as indicated in comments:
ALS - Hussein Y. Afeefy, Joel F. Liebman, and Stephen E. Stein
DH - Eugene S. Domalski and Elizabeth D. Hearing
Quantity | Value | Units | Method | Reference | Comment |
---|---|---|---|---|---|
ΔfH°liquid | -24.04 ± 0.15 | kcal/mol | Ccr | Hubbard and Waddington, 1954 | Heat of combustion calculated author's U=-675.26; ALS |
Quantity | Value | Units | Method | Reference | Comment |
ΔcH°liquid | -675.26 ± 0.12 | kcal/mol | Ccr | Hubbard and Waddington, 1954 | Heat of combustion calculated author's U=-675.26; ALS |
Quantity | Value | Units | Method | Reference | Comment |
S°liquid | 57.959 | cal/mol*K | N/A | Pennington, Scott, et al., 1956 | DH |
Constant pressure heat capacity of liquid
Cp,liquid (cal/mol*K) | Temperature (K) | Reference | Comment |
---|---|---|---|
34.551 | 298.15 | Pennington, Scott, et al., 1956 | T = 10 to 320 K.; DH |

Henry's Law data

Data compiled by: Rolf Sander
Henry's Law constant (water solution)
kH(T) = k°H exp(d(ln(kH))/d(1/T) ((1/T) - 1/(298.15 K)))
k°H = Henry's law constant for solubility in water at 298.15 K (mol/(kg*bar))
d(ln(kH))/d(1/T) = Temperature dependence constant (K)
k°H (mol/(kg*bar)) | d(ln(kH))/d(1/T) (K) | Method | Reference |
---|---|---|---|
0.25 | 3600. | M | N/A |

Van Den Dool and Kratz RI, non-polar column, temperature ramp

Data compiled by: NIST Mass Spectrometry Data Center, William E. Wallace, director

Column type CapillaryCapillaryCapillaryCapillary
Active phase CP-Sil 8CB-MSUltra-1HP-1DB-1
Column length (m) 60.25.50.60.
Carrier gas  H2HeHe
Substrate
Column diameter (mm) 0.250.20.320.25
Phase thickness (μm) 0.250.331.050.25
Tstart (C) 40.60.40.40.
Tend (C) 280.230.260.220.
Heat rate (K/min) 4.2.2.2.
Initial hold (min) 2.
Final hold (min) 5.  10.
I 614.600.0587.624.
ReferenceBruna, Hierro, et al., 2003Farkas, Hradský, et al., 1992Kuo and Ho, 1992Zhang and Ho, 1991
Comment MSDC-RI MSDC-RI MSDC-RI MSDC-RI

Kovats' RI, polar column, isothermal

Data compiled by: NIST Mass Spectrometry Data Center, William E. Wallace, director

Column type Packed
Active phase Carbowax 20M
Column length (m) 6.
Carrier gas He
Substrate Chromosorb W AW (80-100 mesh)
Column diameter (mm)
Phase thickness (μm)
Temperature (C) 110.
I 840.
ReferenceMöckel and Zolg, 1977
Comment MSDC-RI

Normal alkane RI, non-polar column, custom temperature program

Data compiled by: NIST Mass Spectrometry Data Center, William E. Wallace, director

Column type CapillaryCapillaryCapillaryCapillary
Active phase HP-5PONAPolydimethyl siloxanesOV-1, SE-30, Methyl silicone, SP-2100, OV-101, DB-1, etc.
Column length (m) 60.50. 50.
Carrier gas Helium  Hydrogen
Substrate
Column diameter (mm) 0.250.20 0.32
Phase thickness (μm) 0.250.50
Program 30 0C (2 min) 2 0Cmin -> 60 0C 10 0C/min -> 100 0C 20 0C/min -> 140 0C 10 0C/min -> 200 0C (10 min)not specifiednot specifiednot specified
I 609.600.605.596.
ReferenceRotsatschakul, Visesanguan, et al., 2009Yang, Wang, et al., 2003Zenkevich, 1998Waggott and Davies, 1984
Comment MSDC-RI MSDC-RI MSDC-RI MSDC-RI

Kovats' RI, non-polar column, custom temperature program

Data compiled by: NIST Mass Spectrometry Data Center, William E. Wallace, director

Column type Capillary
Active phase Apiezon M
Column length (m)
Carrier gas
Substrate
Column diameter (mm)
Phase thickness (μm)
Program not specified
I 623.
ReferenceZhu, Wang, et al., 2007
Comment MSDC-RI

References

Pennington, Scott, et al., 1956
Pennington, R.E.; Scott, D.W.; Finke, H.L.; McCullough, J.P.; Messerly, J.F.; Hossenlopp, I.A.; Waddington, G.,
The chemical thermodynamic properties and rotational tautomerism of 1-propanethiol.,
J. Am. Chem. Soc., 1956, 78, 3266-72. [all data]
Anonymous, 1954
Anonymous, R.,
, Am. Pet. Inst. Res. Proj. 45, Tech. Rep. 13, Ohio State Univ., 1954. [all data]
Teja and Anselme, 1990
Teja, A.S.; Anselme, M.J.,
The critical properties of thermally stable and unstable fluids. II. 1986 results,
AIChE Symp. Ser., 1990, 86, 279, 122-7. [all data]
Majer and Svoboda, 1985
Majer, V.; Svoboda, V.,
Enthalpies of Vaporization of Organic Compounds: A Critical Review and Data Compilation, Blackwell Scientific Publications, Oxford, 1985, 300. [all data]
Reid, 1972
Reid, Robert C.,
Handbook on vapor pressure and heats of vaporization of hydrocarbons and related compounds, R. C. Wilhort and B. J. Zwolinski, Texas A Research Foundation. College Station, Texas(1971). 329 pages.$10.00,
AIChE J., 1972, 18, 6, 1278-1278, https://doi.org/10.1002/aic.690180637
. [all data]
Pennington, Scott, et al., 1956, 2
Pennington, R.E.; Scott, D.W.; Finke, H.L.; McCullough, J.P.; Messerly, J.F.; Hossenlopp, I.A.; Waddington, G.,
The chemical thermodynamic properties and rotational tautomerism of 1-propanethiol,
J. Am. Chem. Soc., 1956, 78, 3266-32. [all data]
Hubbard and Waddington, 1954
Hubbard, W.N.; Waddington, G.,
The heat of combustion, formation and isomerization of propanethiol-1, propane-thiol-2 and 2-thiabutane,
Rec. Trav. Chim. Pays/Bas, 1954, 73, 910. [all data]
Dykyj, Svoboda, et al., 1999
Dykyj, J.; Svoboda, J.; Wilhoit, R.C.; Frenkel, M.L.; Hall, K.R.,
Vapor Pressure of Chemicals: Part A. Vapor Pressure and Antoine Constants for Hydrocarbons and Sulfur, Selenium, Tellurium and Hydrogen Containing Organic Compounds, Springer, Berlin, 1999, 373. [all data]
Stephenson and Malanowski, 1987
Stephenson, Richard M.; Malanowski, Stanislaw,
Handbook of the Thermodynamics of Organic Compounds, 1987, https://doi.org/10.1007/978-94-009-3173-2
. [all data]
Pennington, Scott, et al., 1956, 3
Pennington, R.E.; Scott, D.W.; Finke, H.L.; McCullough, J.P.; Messerly, J.F.; Hossenlopp, I.A.; Waddington, G.,
The chemical thermodynamic properties and rotational tautomerism of 1-propanethiol,
J. Am. Chem. Soc., 1956, 78, 3266-3272. [all data]
Osborn and Douslin, 1966
Osborn, A.G.; Douslin, D.R.,
Vapor Pressure Relations of 36 Sulfur Compounds Present in Petroleum.,
J. Chem. Eng. Data, 1966, 11, 4, 502-509, https://doi.org/10.1021/je60031a014
. [all data]
Hubbard and Waddington, 2010
Hubbard, Ward N.; Waddington, Guy,
The heats of combustion, formation and isomerization of propanethiol-1, propane-thiol-2 and 2-thiabutane,
Recl. Trav. Chim. Pays-Bas, 2010, 73, 11, 910-923, https://doi.org/10.1002/recl.19540731107
. [all data]
Taylor and Layng, 1933
Taylor, H. Austin; Layng, Edwin T.,
The Thermal Decomposition of Propyl Mercaptan,
J. Chem. Phys., 1933, 1, 11, 798, https://doi.org/10.1063/1.1749248
. [all data]
Domalski and Hearing, 1996
Domalski, Eugene S.; Hearing, Elizabeth D.,
Heat Capacities and Entropies of Organic Compounds in the Condensed Phase. Volume III,
J. Phys. Chem. Ref. Data, 1996, 25, 1, 1, https://doi.org/10.1063/1.555985
. [all data]
Stone and Splinter, 1984
Stone, J.A.; Splinter, D.E.,
A high-pressure mass spectrometric study of the binding of (CH3)3Sn+ to lewis bases in the gas phase,
Int. J. Mass Spectrom. Ion Processes, 1984, 59, 169. [all data]
Bartmess, Scott, et al., 1979
Bartmess, J.E.; Scott, J.A.; McIver, R.T., Jr.,
The gas phase acidity scale from methanol to phenol,
J. Am. Chem. Soc., 1979, 101, 6047. [all data]
Sunner, 1955
Sunner, S.,
Strain in 6,8-thioctic acid,
Nature (London), 1955, 176, 217. [all data]
Wadso, 1957
Wadso, I.,
The heats of hydrolysis of some alkyl thiolesters,
Acta Chem. Scand., 1957, 11, 1745-1751. [all data]
Hunter and Lias, 1998
Hunter, E.P.; Lias, S.G.,
Evaluated Gas Phase Basicities and Proton Affinities of Molecules: An Update,
J. Phys. Chem. Ref. Data, 1998, 27, 3, 413-656, https://doi.org/10.1063/1.556018
. [all data]
Kimura, Katsumata, et al., 1981
Kimura, K.; Katsumata, S.; Achiba, Y.; Yamazaki, T.; Iwata, S.,
Ionization energies, Ab initio assignments, and valence electronic structure for 200 molecules
in Handbook of HeI Photoelectron Spectra of Fundamental Organic Compounds, Japan Scientific Soc. Press, Tokyo, 1981. [all data]
Ogata, Onizuka, et al., 1973
Ogata, H.; Onizuka, H.; Nihei, Y.; Kamada, H.,
The photoelectron spectra of alcohols, mercaptans and amines,
Bull. Chem. Soc. Jpn., 1973, 46, 3036. [all data]
Watanabe, Nakayama, et al., 1962
Watanabe, K.; Nakayama, T.; Mottl, J.,
Ionization potentials of some molecules,
J. Quant. Spectry. Radiative Transfer, 1962, 2, 369. [all data]