1,3-Butadiene
- Formula: C4H6
- Molecular weight: 54.0904
- IUPAC Standard InChIKey: KAKZBPTYRLMSJV-UHFFFAOYSA-N
- CAS Registry Number: 106-99-0
- Chemical structure:
View 3d structure (requires JavaScript / HTML 5) - Other names: α,γ-Butadiene; Biethylene; Bivinyl; Buta-1,3-diene; Butadiene; Divinyl; Erythrene; Pyrrolylene; Vinylethylene; CH2=CHCH=CH2; Butadieen; Buta-1,3-dieen; Butadien; Buta-1,3-dien; NCI-C50602

Gas phase thermochemistry data

Data compiled as indicated in comments:
ALS - Hussein Y. Afeefy, Joel F. Liebman, and Stephen E. Stein
GT - Glushko Thermocenter, Russian Academy of Sciences, Moscow
Quantity | Value | Units | Method | Reference | Comment |
---|---|---|---|---|---|
ΔfH°gas | 26.00 ± 0.19 | kcal/mol | Cm | Prosen, Maron, et al., 1951 | ALS |
ΔfH°gas | 26.75 ± 0.23 | kcal/mol | Ccb | Prosen and Rossini, 1945 | ALS |
Quantity | Value | Units | Method | Reference | Comment |
ΔcH°gas | -607.16 ± 0.18 | kcal/mol | Cm | Prosen, Maron, et al., 1951 | Corresponding ΔfHºgas = 26.01 kcal/mol (simple calculation by NIST; no Washburn corrections); ALS |
Constant pressure heat capacity of gas
Cp,gas (cal/mol*K) | Temperature (K) | Reference | Comment |
---|---|---|---|
8.387 | 50. | Thermodynamics Research Center, 1997 | p=1 bar. Recommended values are in excellent agreement with experiment and other statistically calculated values [ Sverdlov L.M., 1962, Compton D.A.C., 1976]. Discrepancies with earlier calculations [ Aston J.D., 1946] and [ Godnev I., 1947] amount to 4.7 and 2.7 J/mol*K, respectively, in S(T) and 3.6 and 2.4 J/mol*K in Cp(T).; GT |
9.873 | 100. | ||
11.54 | 150. | ||
13.66 | 200. | ||
17.61 | 273.15 | ||
19.08 | 298.15 | ||
19.18 | 300. | ||
24.723 | 400. | ||
29.180 | 500. | ||
32.627 | 600. | ||
35.382 | 700. | ||
37.684 | 800. | ||
39.656 | 900. | ||
41.372 | 1000. | ||
42.868 | 1100. | ||
44.178 | 1200. | ||
45.325 | 1300. | ||
46.331 | 1400. | ||
47.213 | 1500. |

Condensed phase thermochemistry data

Data compiled as indicated in comments:
ALS - Hussein Y. Afeefy, Joel F. Liebman, and Stephen E. Stein
DH - Eugene S. Domalski and Elizabeth D. Hearing
Quantity | Value | Units | Method | Reference | Comment |
---|---|---|---|---|---|
ΔfH°liquid | 21.63 ± 0.23 | kcal/mol | Ccb | Prosen and Rossini, 1945 | ALS |
Quantity | Value | Units | Method | Reference | Comment |
ΔcH°liquid | -602.79 ± 0.23 | kcal/mol | Ccb | Prosen and Rossini, 1945 | Corresponding ΔfHºliquid = 21.64 kcal/mol (simple calculation by NIST; no Washburn corrections); ALS |
Quantity | Value | Units | Method | Reference | Comment |
S°liquid | 47.562 | cal/mol*K | N/A | Scott, Meyers, et al., 1945 | At vapor pressure of 2105 Torr.; DH |
Constant pressure heat capacity of liquid
Cp,liquid (cal/mol*K) | Temperature (K) | Reference | Comment |
---|---|---|---|
29.553 | 298.15 | Scott, Meyers, et al., 1945 | T = 15 to 303 K.; DH |

Phase change data

Data compiled as indicated in comments:
BS - Robert L. Brown and Stephen E. Stein
TRC - Thermodynamics Research Center, NIST Boulder Laboratories, Chris Muzny director
AC - William E. Acree, Jr., James S. Chickos
DH - Eugene S. Domalski and Elizabeth D. Hearing
Quantity | Value | Units | Method | Reference | Comment |
---|---|---|---|---|---|
Tboil | 268.6 ± 0.3 | K | AVG | N/A | Average of 10 out of 11 values; Individual data points |
Quantity | Value | Units | Method | Reference | Comment |
Tfus | 164.3 ± 0.2 | K | AVG | N/A | Average of 6 values; Individual data points |
Quantity | Value | Units | Method | Reference | Comment |
Ttriple | 164.24 | K | N/A | Scott, Meyers, et al., 1945 | Uncertainty assigned by TRC = 0.02 K; TRC |
Quantity | Value | Units | Method | Reference | Comment |
Tc | 425. ± 1. | K | N/A | Tsonopoulos and Ambrose, 1996 | |
Tc | 425. | K | N/A | Majer and Svoboda, 1985 | |
Quantity | Value | Units | Method | Reference | Comment |
Pc | 42.6 ± 0.99 | atm | N/A | Tsonopoulos and Ambrose, 1996 | |
Quantity | Value | Units | Method | Reference | Comment |
Vc | 0.221 | l/mol | N/A | Tsonopoulos and Ambrose, 1996 | |
Quantity | Value | Units | Method | Reference | Comment |
ρc | 4.53 ± 0.10 | mol/l | N/A | Tsonopoulos and Ambrose, 1996 | |
Quantity | Value | Units | Method | Reference | Comment |
ΔvapH° | 5.131 | kcal/mol | N/A | Majer and Svoboda, 1985 | |
ΔvapH° | 5.04 | kcal/mol | N/A | Reid, 1972 | See also Prosen and Rossini, 1945, 2.; AC |
Enthalpy of vaporization
ΔvapH (kcal/mol) | Temperature (K) | Method | Reference | Comment |
---|---|---|---|---|
5.370 | 268.7 | N/A | Majer and Svoboda, 1985 | |
0.01946 | 273.15 | N/A | Scott, Meyers, et al., 1945 | P = 119.95 kPa; DH |
5.5 | 285. | A | Stephenson and Malanowski, 1987 | Based on data from 270. to 318. K.; AC |
6.14 | 203. | A | Stephenson and Malanowski, 1987 | Based on data from 193. to 213. K.; AC |
5.64 | 261. | A | Stephenson and Malanowski, 1987 | Based on data from 213. to 276. K.; AC |
5.35 | 330. | A | Stephenson and Malanowski, 1987 | Based on data from 315. to 382. K.; AC |
5.47 | 395. | A | Stephenson and Malanowski, 1987 | Based on data from 380. to 425. K.; AC |
5.66 | 256. | N/A | Boublik, Fried, et al., 1984 | Based on data from 198. to 271. K. See also Heisig, 1933.; AC |
5.90 | 235. | N/A | Vaughan, 1932 | Based on data from 191. to 249. K. See also Boublik, Fried, et al., 1984.; AC |
Enthalpy of vaporization
ΔvapH =
A exp(-βTr) (1 − Tr)β
ΔvapH =
Enthalpy of vaporization (at saturation pressure)
(kcal/mol)
Tr = reduced temperature (T / Tc)
View plot Requires a JavaScript / HTML 5 canvas capable browser.
Temperature (K) | A (kcal/mol) | β | Tc (K) | Reference | Comment |
---|---|---|---|---|---|
247. to 296. | 8.329 | 0.2687 | 425. | Majer and Svoboda, 1985 |
Entropy of vaporization
ΔvapS (cal/mol*K) | Temperature (K) | Reference | Comment |
---|---|---|---|
67.075 | 273.15 | Scott, Meyers, et al., 1945 | P; DH |
Antoine Equation Parameters
log10(P) = A − (B / (T + C))
P = vapor pressure (atm)
T = temperature (K)
View plot Requires a JavaScript / HTML 5 canvas capable browser.
Temperature (K) | A | B | C | Reference | Comment |
---|---|---|---|---|---|
197.7 to 271.7 | 3.99227 | 941.662 | -32.753 | Heisig, 1933 | Coefficents calculated by NIST from author's data. |
Enthalpy of fusion
ΔfusH (kcal/mol) | Temperature (K) | Reference | Comment |
---|---|---|---|
1.9082 | 164.24 | Scott, Meyers, et al., 1945 | DH |
1.91 | 164.2 | Acree, 1991 | AC |
Entropy of fusion
ΔfusS (cal/mol*K) | Temperature (K) | Reference | Comment |
---|---|---|---|
11.62 | 164.24 | Scott, Meyers, et al., 1945 | DH |

Reaction thermochemistry data

Data compiled as indicated in comments:
ALS - Hussein Y. Afeefy, Joel F. Liebman, and Stephen E. Stein
B - John E. Bartmess
RCD - Robert C. Dunbar
Individual Reactions
By formula: C4H6 + 2H2 = C4H10
Quantity | Value | Units | Method | Reference | Comment |
---|---|---|---|---|---|
ΔrH° | -56.57 ± 0.10 | kcal/mol | Chyd | Kistiakowsky, Ruhoff, et al., 1936 | gas phase; Reanalyzed by Cox and Pilcher, 1970, Original value = -57.1 ± 0.1 kcal/mol; At 355 °K; ALS |
C4H5- + =
Quantity | Value | Units | Method | Reference | Comment |
---|---|---|---|---|---|
ΔrH° | 399.5 ± 3.1 | kcal/mol | G+TS | Devisser, Dekoning, et al., 1995 | gas phase; B |
Quantity | Value | Units | Method | Reference | Comment |
ΔrG° | 391.3 ± 3.0 | kcal/mol | IMRB | Devisser, Dekoning, et al., 1995 | gas phase; B |
By formula: Na+ + C4H6 = (Na+ • C4H6)
Free energy of reaction
ΔrG° (kcal/mol) | T (K) | Method | Reference | Comment |
---|---|---|---|---|
10.3 | 298. | IMRE | McMahon and Ohanessian, 2000 | Anchor alanine=39.89; RCD |
(CAS Reg. No. 88032-19-3 • 4294967295) +
= CAS Reg. No. 88032-19-3
By formula: (CAS Reg. No. 88032-19-3 • 4294967295C4H6) + C4H6 = CAS Reg. No. 88032-19-3
Quantity | Value | Units | Method | Reference | Comment |
---|---|---|---|---|---|
ΔrH° | 14.7 ± 2.1 | kcal/mol | N/A | DePuy, Gronert, et al., 1989 | gas phase; B |
By formula: C8H8O3 = C4H6 + C4H2O3
Quantity | Value | Units | Method | Reference | Comment |
---|---|---|---|---|---|
ΔrH° | 67.79 ± 0.23 | kcal/mol | Cm | Ghitau, Ciopec, et al., 1983 | solid phase; At 65 to 90°C; ALS |
By formula: C4H6 + O2S = C4H6O2S
Quantity | Value | Units | Method | Reference | Comment |
---|---|---|---|---|---|
ΔrH° | -17.9 | kcal/mol | Eqk | Mackle and McNally, 1969 | gas phase; ALS |
By formula: C4H6 + C4H2O3 = C8H8O3
Quantity | Value | Units | Method | Reference | Comment |
---|---|---|---|---|---|
ΔrH° | -67.788 | kcal/mol | Cm | Ghitau, Ciopec, et al., 1983 | liquid phase; ALS |
By formula: C4H6 + O2S = C4H6O2S
Quantity | Value | Units | Method | Reference | Comment |
---|---|---|---|---|---|
ΔrH° | -16.5 | kcal/mol | Eqk | Mackle and McNally, 1969 | gas phase; ALS |
By formula: C4H6 = C4H6
Quantity | Value | Units | Method | Reference | Comment |
---|---|---|---|---|---|
ΔrH° | 12.78 ± 0.16 | kcal/mol | Ccb | Prosen, Maron, et al., 1949 | gas phase; ALS |
By formula: Au+ + C4H6 = (Au+ • C4H6)
Quantity | Value | Units | Method | Reference | Comment |
---|---|---|---|---|---|
ΔrH° | >75. | kcal/mol | IMRB | Schroeder, Hrusak, et al., 1995 | RCD |

Henry's Law data

Data compiled by: Rolf Sander
Henry's Law constant (water solution)
kH(T) = k°H exp(d(ln(kH))/d(1/T) ((1/T) - 1/(298.15 K)))
k°H = Henry's law constant for solubility in water at 298.15 K (mol/(kg*bar))
d(ln(kH))/d(1/T) = Temperature dependence constant (K)
k°H (mol/(kg*bar)) | d(ln(kH))/d(1/T) (K) | Method | Reference | Comment |
---|---|---|---|---|
0.014 | Q | N/A | missing citation give several references for the Henry's law constants but don't assign them to specific species. | |
0.014 | L | N/A | ||
0.014 | 4500. | L | N/A | |
0.016 | V | N/A |

Gas phase ion energetics data

Data evaluated as indicated in comments:
HL - Edward P. Hunter and Sharon G. Lias
L - Sharon G. Lias
Data compiled as indicated in comments:
B - John E. Bartmess
LBLHLM - Sharon G. Lias, John E. Bartmess, Joel F. Liebman, John L. Holmes, Rhoda D. Levin, and W. Gary Mallard
LLK - Sharon G. Lias, Rhoda D. Levin, and Sherif A. Kafafi
RDSH - Henry M. Rosenstock, Keith Draxl, Bruce W. Steiner, and John T. Herron
Quantity | Value | Units | Method | Reference | Comment |
---|---|---|---|---|---|
IE (evaluated) | 9.072 ± 0.007 | eV | N/A | N/A | L |
Quantity | Value | Units | Method | Reference | Comment |
Proton affinity (review) | 187.2 | kcal/mol | N/A | Hunter and Lias, 1998 | HL |
Quantity | Value | Units | Method | Reference | Comment |
Gas basicity | 181.1 | kcal/mol | N/A | Hunter and Lias, 1998 | HL |
Ionization energy determinations
IE (eV) | Method | Reference | Comment |
---|---|---|---|
9.082 ± 0.004 | S | Mallard, Miller, et al., 1983 | LBLHLM |
9.07 | PE | Masclet, Mouvier, et al., 1981 | LLK |
9.09 | PE | Kimura, Katsumata, et al., 1981 | LLK |
9.03 | EI | Dannacher, Flamme, et al., 1980 | LLK |
9.03 | PE | Bieri and Asbrink, 1980 | LLK |
9.03 ± 0.02 | PE | Bieri, Burger, et al., 1977 | LLK |
9.0691 | S | McDiarmid, 1976 | LLK |
9.06 | PE | Brundle and Robin, 1970 | RDSH |
9.06 ± 0.02 | PI | Matthews and Warneck, 1969 | RDSH |
9.09 ± 0.05 | PE | Eland, 1969 | RDSH |
9.07 ± 0.02 | PI | Parr and Elder, 1968 | RDSH |
9.07 | PE | Dewar and Worley, 1968 | RDSH |
~9.2 | DER | Dewar and Worley, 1968 | RDSH |
9.18 ± 0.04 | EI | Bock and Seidl, 1968 | RDSH |
9.09 ± 0.03 | EI | Franklin and Mogenis, 1967 | RDSH |
9.075 ± 0.005 | PI | Brehm, 1966 | RDSH |
9.07 ± 0.01 | PI | Watanabe, 1954 | RDSH |
9.06 ± 0.01 | S | Price and Walsh, 1940 | RDSH |
9.03 | PE | Schmidt, Schweig, et al., 1976 | Vertical value; LLK |
Appearance energy determinations
De-protonation reactions
C4H5- + =
Quantity | Value | Units | Method | Reference | Comment |
---|---|---|---|---|---|
ΔrH° | 399.5 ± 3.1 | kcal/mol | G+TS | Devisser, Dekoning, et al., 1995 | gas phase; B |
Quantity | Value | Units | Method | Reference | Comment |
ΔrG° | 391.3 ± 3.0 | kcal/mol | IMRB | Devisser, Dekoning, et al., 1995 | gas phase; B |

Ion clustering data

Data compiled by: Robert C. Dunbar
Clustering reactions
By formula: Au+ + C4H6 = (Au+ • C4H6)
Quantity | Value | Units | Method | Reference | Comment |
---|---|---|---|---|---|
ΔrH° | >75. | kcal/mol | IMRB | Schroeder, Hrusak, et al., 1995 |
By formula: Na+ + C4H6 = (Na+ • C4H6)
Free energy of reaction
ΔrG° (kcal/mol) | T (K) | Method | Reference | Comment |
---|---|---|---|---|
10.3 | 298. | IMRE | McMahon and Ohanessian, 2000 | Anchor alanine=39.89 |

Vibrational and/or electronic energy levels

Data compiled by: Takehiko Shimanouchi
Symmetry: C2h Symmetry Number σ = 2
Sym. | No | Approximate | Selected Freq. | Infrared | Raman | Comments | ||||
---|---|---|---|---|---|---|---|---|---|---|
Species | type of mode | Value | Rating | Value | Phase | Value | Phase | |||
ag | 1 | CH2 a-str | 3087 | D | ia | 3087 M | sln. | |||
ag | 2 | CH str | 3003 | D | ia | 3003 M | sln. | |||
ag | 3 | CH2 s-str | 2992 | D | ia | 2992 S | sln. | |||
ag | 4 | C=C str | 1630 | D | ia | 1630 VS | sln. | |||
ag | 5 | CH2 scis | 1438 | D | ia | 1438 S | sln. | |||
ag | 6 | CH bend | 1280 | D | ia | 1280 S | sln. | |||
ag | 7 | C-C str | 1196 | D | ia | 1196 S | sln. | |||
ag | 8 | CH2 rock | 894 | D | ia | 894 W | sln. | |||
ag | 9 | CCC deform | 512 | D | ia | 512 S | sln. | |||
au | 10 | CH bend | 1013 | B | 1013.4 VS | ia | ||||
au | 11 | CH2 wag | 908 | B | 907.8 VS | ia | ||||
au | 12 | CH2 twist | 522 | B | 522.2 M | ia | ||||
au | 13 | C-C torsion | 162 | B | 162.3 VW | ia | ||||
bg | 14 | CH bend | 976 | D | ia | 976 W | sln. | |||
bg | 15 | CH2 wag | 912 | D | ia | 912 S | sln. | |||
bg | 16 | CH2 twist | 770 | D | ia | 770 VW | sln. | |||
bu | 17 | CH2 a-str | 3101 | B | 3100.6 S | ia | ||||
bu | 18 | CH str | 3055 | B | 3054.9 S | ia | ||||
bu | 19 | CH2 s-str | 2984 | B | 2984.3 S | ia | ||||
bu | 20 | C=C str | 1596 | B | 1596.0 S | ia | ||||
bu | 21 | CH2 scis | 1381 | B | 1380.7 W | ia | ||||
bu | 22 | CH bend | 1294 | B | 1294.3 W | ia | ||||
bu | 23 | CH2 rock | 990 | B | 989.7 M | ia | ||||
bu | 24 | CCC deform | 301 | B | 300.6 VW | ia | ||||
Source: Shimanouchi, 1972

Kovats' RI, non-polar column, isothermal

Data compiled by: NIST Mass Spectrometry Data Center, William E. Wallace, director

Column type CapillaryCapillaryCapillaryCapillaryCapillary
Active phase BPX-5BPX-5CP Sil 5 CBSE-30Squalane
Column length (m) 12.12.25.100.
Carrier gas H2H2H2
Substrate
Column diameter (mm) 0.150.150.150.5
Phase thickness (μm) 0.250.252.
Temperature (C) 30.30.20.60.50.
I 400.400.394.3397.385.6
ReferenceAflalaye, Sternberg, et al., 1995Aflalaye, Sternberg, et al., 1995Do and Raulin, 1992Bredael, 1982Schröder, 1980
Comment MSDC-RI MSDC-RI MSDC-RI MSDC-RI MSDC-RI
Column type PackedPackedPackedPackedPacked
Active phase SqualaneSqualaneSqualaneSqualaneSE-30
Column length (m) 15.15.15.15.7.9
Carrier gas HeHeHeHe
Substrate Chromosorb PChromosorb PChromosorb PChromosorb PDiatoport S
Column diameter (mm) 0.250.250.250.25
Phase thickness (μm)
Temperature (C) 27.49.67.86.70.
I 386.386.387.388.405.
ReferenceHively and Hinton, 1968Hively and Hinton, 1968Hively and Hinton, 1968Hively and Hinton, 1968Widmer, 1967
Comment MSDC-RI MSDC-RI MSDC-RI MSDC-RI MSDC-RI
Column type Packed
Active phase Squalane
Column length (m) 10.
Carrier gas
Substrate
Column diameter (mm)
Phase thickness (μm)
Temperature (C) 26.
I 389.
ReferenceZulaïca and Guiochon, 1966
Comment MSDC-RI

Kovats' RI, non-polar column, custom temperature program

Data compiled by: NIST Mass Spectrometry Data Center, William E. Wallace, director

Column type CapillaryCapillary
Active phase Petrocol DH-100DB-1
Column length (m) 100.60.
Carrier gas HeHe
Substrate
Column diameter (mm) 0.20.32
Phase thickness (μm)  1.0
Program 5C(10min) => 5C/min => 50C(48min) => 1.5C/min => 195C(91min)-40 C for 12 min; -40 - 125 C at 3 deg.min; 125-185 C at 6 deg/min; 185 - 220 C at 20 deg/min; hold 220 C for 2 min
I 393.395.
ReferenceHaagen-Smit Laboratory, 1997Hoekman, 1993
Comment MSDC-RI MSDC-RI

Kovats' RI, polar column, isothermal

Data compiled by: NIST Mass Spectrometry Data Center, William E. Wallace, director

Column type PackedPacked
Active phase Carbowax 20MCarbowax 20M
Column length (m) 7.97.9
Carrier gas
Substrate Diatoport PDiatoport P
Column diameter (mm)
Phase thickness (μm)
Temperature (C) 130.70.
I 507.487.
ReferenceWidmer, 1967Widmer, 1967
Comment MSDC-RI MSDC-RI

Van Den Dool and Kratz RI, non-polar column, custom temperature program

Data compiled by: NIST Mass Spectrometry Data Center, William E. Wallace, director

Column type Packed
Active phase SE-30
Column length (m) 3.05
Carrier gas
Substrate Supelcoport; Chromosorb
Column diameter (mm)
Phase thickness (μm)
Program 40C(5min) => 10C/min => 200C or 250C (60min)
I 395.
ReferencePeng, Ding, et al., 1988
Comment MSDC-RI

References

Prosen, Maron, et al., 1951
Prosen, E.J.; Maron, F.W.; Rossini, F.D.,
Heats of combustion, formation, and insomerization of ten C4 hydrocarbons,
J. Res. NBS, 1951, 46, 106-112. [all data]
Prosen and Rossini, 1945
Prosen, E.J.; Rossini, F.D.,
Heats of formation and combustion of 1,3-butadiene and styrene,
J. Res. NBS, 1945, 34, 59-63. [all data]
Thermodynamics Research Center, 1997
Thermodynamics Research Center,
Selected Values of Properties of Chemical Compounds., Thermodynamics Research Center, Texas A&M University, College Station, Texas, 1997. [all data]
Sverdlov L.M., 1962
Sverdlov L.M.,
Calculation of thermodynamic functions of gaseous 1,3-butadiene from spectroscopic data,
Zh. Fiz. Khim., 1962, 36, 2765-2767. [all data]
Compton D.A.C., 1976
Compton D.A.C.,
Conformations of conjugated hydrocarbons. Part 1. A spectroscopic and thermodynamic study of buta-1,3-diene and 2-methylbuta-1,3-diene,
J. Chem. Soc. Perkin Trans. 2, 1976, 1666-1671. [all data]
Aston J.D., 1946
Aston J.D.,
Thermodynamic properties of gaseous 1,3-butadiene and normal butenes above 25 C. Equilibria in the system 1,3-butadiene, n-butenes, and n-butane,
J. Chem. Phys., 1946, 14, 67-79. [all data]
Godnev I., 1947
Godnev I.,
Thermodynamic functions of divinyl and equilibrium constant of formation of divinyl from alcohol,
Zh. Fiz. Khim., 1947, 21, 799-809. [all data]
Scott, Meyers, et al., 1945
Scott, R.B.; Meyers, C.H.; Rands, R.D., Jr.; Brickwedde, F.G.; Bekkedahl, N.,
Thermodynamic properties of 1,3-butadiene in the solid, liquid, and vapor states,
J. Res. NBS, 1945, 35, 39-85. [all data]
Tsonopoulos and Ambrose, 1996
Tsonopoulos, C.; Ambrose, D.,
Vapor-Liquid Critical Properties of Elements and Compounds. 6. Unsaturated Aliphatic Hydrocarbons,
J. Chem. Eng. Data, 1996, 41, 645-656. [all data]
Majer and Svoboda, 1985
Majer, V.; Svoboda, V.,
Enthalpies of Vaporization of Organic Compounds: A Critical Review and Data Compilation, Blackwell Scientific Publications, Oxford, 1985, 300. [all data]
Reid, 1972
Reid, Robert C.,
Handbook on vapor pressure and heats of vaporization of hydrocarbons and related compounds, R. C. Wilhort and B. J. Zwolinski, Texas A Research Foundation. College Station, Texas(1971). 329 pages.$10.00,
AIChE J., 1972, 18, 6, 1278-1278, https://doi.org/10.1002/aic.690180637
. [all data]
Prosen and Rossini, 1945, 2
Prosen, E.J.; Rossini, F.D.,
Heats of formation and combustion of 1,3-butadiene and styrene,
J. RES. NATL. BUR. STAN., 1945, 34, 1, 59-17, https://doi.org/10.6028/jres.034.031
. [all data]
Stephenson and Malanowski, 1987
Stephenson, Richard M.; Malanowski, Stanislaw,
Handbook of the Thermodynamics of Organic Compounds, 1987, https://doi.org/10.1007/978-94-009-3173-2
. [all data]
Boublik, Fried, et al., 1984
Boublik, T.; Fried, V.; Hala, E.,
The Vapour Pressures of Pure Substances: Selected Values of the Temperature Dependence of the Vapour Pressures of Some Pure Substances in the Normal and Low Pressure Region, 2nd ed., Elsevier, New York, 1984, 972. [all data]
Heisig, 1933
Heisig, G.B.,
Action of Radon on Some Unsaturated Hydrocarbons. III. Vinylacetylene and Butadiene,
J. Am. Chem. Soc., 1933, 55, 6, 2304-2311, https://doi.org/10.1021/ja01333a015
. [all data]
Vaughan, 1932
Vaughan, William E.,
THE HOMOGENEOUS THERMAL POLYMERIZATION OF 1,3-BUTADIENE,
J. Am. Chem. Soc., 1932, 54, 10, 3863-3876, https://doi.org/10.1021/ja01349a008
. [all data]
Acree, 1991
Acree, William E.,
Thermodynamic properties of organic compounds: enthalpy of fusion and melting point temperature compilation,
Thermochimica Acta, 1991, 189, 1, 37-56, https://doi.org/10.1016/0040-6031(91)87098-H
. [all data]
Kistiakowsky, Ruhoff, et al., 1936
Kistiakowsky, G.B.; Ruhoff, J.R.; Smith, H.A.; Vaughan, W.E.,
Heats of organic reactions. IV. Hydrogenation of some dienes and of benzene,
J. Am. Chem. Soc., 1936, 58, 146-153. [all data]
Cox and Pilcher, 1970
Cox, J.D.; Pilcher, G.,
Thermochemistry of Organic and Organometallic Compounds, Academic Press, New York, 1970, 1-636. [all data]
Devisser, Dekoning, et al., 1995
Devisser, S.P.; Dekoning, L.J.; Vanderhart, W.J.; Nibbering, N.M.M.,
Chemical properties of butadienyl anions in the gas-phase,
Recl. Trav. Chim. Pays-Bas, 1995, 114, 6, 267, https://doi.org/10.1002/recl.19951140603
. [all data]
McMahon and Ohanessian, 2000
McMahon, T.B.; Ohanessian, G.,
An Experimental and Ab Initio Study of the Nature of the Binding in Gas-Phase Complexes of Sodium Ions,
Chem. Eur. J., 2000, 6, 16, 2931, https://doi.org/10.1002/1521-3765(20000818)6:16<2931::AID-CHEM2931>3.0.CO;2-7
. [all data]
DePuy, Gronert, et al., 1989
DePuy, C.H.; Gronert, S.; Barlow, S.E.; Bierbaum, V.M.; Damrauer, R.,
The Gas Phase Acidities of the Alkanes,
J. Am. Chem. Soc., 1989, 111, 6, 1968, https://doi.org/10.1021/ja00188a003
. [all data]
Ghitau, Ciopec, et al., 1983
Ghitau, M.; Ciopec, M.; Pintea, O.,
Study on Diels-Alder reaction for the synthesis of tetrahydrophthalic anhydride,
Rev. Chim. (Bucharest), 1983, 34, 299-305. [all data]
Mackle and McNally, 1969
Mackle, H.; McNally, D.V.,
Studies in the thermochemistry of sulphones. Part 9 - Thermochemistry of the butadiene and isoprene sulphones,
Trans. Faraday Soc., 1969, 65, 1738-1741. [all data]
Prosen, Maron, et al., 1949
Prosen, E.J.; Maron, F.W.; Rossini, F.D.,
Heat of isomerization of the two butadienes,
J. Res. NBS, 1949, 42, 269-275. [all data]
Schroeder, Hrusak, et al., 1995
Schroeder, D.; Hrusak, J.; Hertwig, R.H.; Koch, W.; Schwerdtfeger, P.; Schwarz, H.,
Experimental and Theoretical Studies of Gold(I) Complexes Au(L)+ (L=H2O, CO, NH3, C2H4, C3H6, C4H6, C6H6, C6F6),
Organometallics, 1995, 14, 1, 312, https://doi.org/10.1021/om00001a045
. [all data]
Hunter and Lias, 1998
Hunter, E.P.; Lias, S.G.,
Evaluated Gas Phase Basicities and Proton Affinities of Molecules: An Update,
J. Phys. Chem. Ref. Data, 1998, 27, 3, 413-656, https://doi.org/10.1063/1.556018
. [all data]
Mallard, Miller, et al., 1983
Mallard, W.G.; Miller, J.H.; Smyth, K.C.,
The ns Rydberg series of 1,3-trans-butadiene observed using multiphoton ionization,
J. Chem. Phys., 1983, 79, 5900. [all data]
Masclet, Mouvier, et al., 1981
Masclet, P.; Mouvier, G.; Bocquet, J.F.,
Effets electroniques et effets steriques dus a la substitution alcoyle dans les dienes conjugues,
J. Chim. Phys., 1981, 78, 99. [all data]
Kimura, Katsumata, et al., 1981
Kimura, K.; Katsumata, S.; Achiba, Y.; Yamazaki, T.; Iwata, S.,
Ionization energies, Ab initio assignments, and valence electronic structure for 200 molecules
in Handbook of HeI Photoelectron Spectra of Fundamental Organic Compounds, Japan Scientific Soc. Press, Tokyo, 1981. [all data]
Dannacher, Flamme, et al., 1980
Dannacher, J.; Flamme, J.P.; Stadelmann, J.P.; Vogt, J.,
Unimolecular fragmentations of internal energy selected 1,3-butadiene cations,
Chem. Phys., 1980, 51, 189. [all data]
Bieri and Asbrink, 1980
Bieri, G.; Asbrink, L.,
30.4-nm He(II) photoelectron spectra of organic molecules,
J. Electron Spectrosc. Relat. Phenom., 1980, 20, 149. [all data]
Bieri, Burger, et al., 1977
Bieri, G.; Burger, F.; Heilbronner, E.; Maier, J.P.,
Valence ionization enrgies of hydrocarbons,
Helv. Chim. Acta, 1977, 60, 2213. [all data]
McDiarmid, 1976
McDiarmid, R.,
On the ultraviolet spectrum of trans-1,3-butadiene,
J. Chem. Phys., 1976, 64, 514. [all data]
Brundle and Robin, 1970
Brundle, C.R.; Robin, M.B.,
Nonplanarity in hexafluorobutadiene as revealed by photoelectron and optical spectroscopy,
J. Am. Chem. Soc., 1970, 92, 5550. [all data]
Matthews and Warneck, 1969
Matthews, C.S.; Warneck, P.,
Heats of formation of CHO+ and C3H3+ by photoionization,
J. Chem. Phys. 5, 1969, 1, 854. [all data]
Eland, 1969
Eland, J.H.D.,
Photoelectron spectra of conjugated hydrocarbons and heteromolecules,
Intern. J. Mass Spectrom. Ion Phys., 1969, 2, 471. [all data]
Parr and Elder, 1968
Parr, A.C.; Elder, F.A.,
Photoionization of 1,3butadiene, 1,2-butadiene, allene, and propyne,
J. Chem. Phys., 1968, 49, 2659. [all data]
Dewar and Worley, 1968
Dewar, M.J.S.; Worley, S.D.,
Ionization potential of cis-1,3-butadiene,
J. Chem. Phys., 1968, 49, 2454. [all data]
Bock and Seidl, 1968
Bock, H.; Seidl, H.,
'd-Orbital effects' in silicon- substituted π-electron systems. XI. Syntheses and properties of the isomeric bis(trimethylsilyl)-1,3-butadienes,
J. Am. Chem. Soc., 1968, 90, 5694. [all data]
Franklin and Mogenis, 1967
Franklin, J.L.; Mogenis, A.,
An electron impact study of ions from several dienes,
J. Phys. Chem., 1967, 71, 2820. [all data]
Brehm, 1966
Brehm, B.,
Massenspektrometrische Untersuchung der Photoionisation von Molekulen,
Z. Naturforsch., 1966, 21a, 196. [all data]
Watanabe, 1954
Watanabe, K.,
Photoionization and total absorption cross section of gases. I. Ionization potentials of several molecules. Cross sections of NH3 and NO,
J. Chem. Phys., 1954, 22, 1564. [all data]
Price and Walsh, 1940
Price, W.C.; Walsh, A.D.,
The absorption spectra of conjugated dienes in the vacuum ultra-violet (1),
Proc. Roy. Soc. (London), 1940, A174, 220. [all data]
Schmidt, Schweig, et al., 1976
Schmidt, H.; Schweig, A.; Anastassiou, A.G.; Wetzel, J.C.,
The dominant role of hyperconjugation in the 9-oxabicyclo[4.2.1]nona-2,4,7-triene series,
Tetrahedron, 1976, 32, 2239. [all data]
Field, Franklin, et al., 1957
Field, F.H.; Franklin, J.L.; Lampe, F.W.,
Reactions of gaseous ions. II. Acetylene,
J. Am. Chem. Soc., 1957, 79, 2665. [all data]