1-Butene
- Formula: C4H8
- Molecular weight: 56.1063
- IUPAC Standard InChIKey: VXNZUUAINFGPBY-UHFFFAOYSA-N
- CAS Registry Number: 106-98-9
- Chemical structure:
View 3d structure (requires JavaScript / HTML 5) - Other names: α-Butene; α-Butylene; But-1-ene; Butene-1; Ethylethylene; 1-Butylene; 1-C4H8

Gas phase thermochemistry data

Data compiled as indicated in comments:
ALS - Hussein Y. Afeefy, Joel F. Liebman, and Stephen E. Stein
GT - Glushko Thermocenter, Russian Academy of Sciences, Moscow
Quantity | Value | Units | Method | Reference | Comment |
---|---|---|---|---|---|
ΔfH°gas | -0.63 ± 0.79 | kJ/mol | Cm | Prosen, Maron, et al., 1951 | ALS |
Quantity | Value | Units | Method | Reference | Comment |
ΔcH°gas | -2716.8 ± 0.75 | kJ/mol | Cm | Prosen, Maron, et al., 1951 | Corresponding ΔfHºgas = -0.54 kJ/mol (simple calculation by NIST; no Washburn corrections); ALS |
Constant pressure heat capacity of gas
Cp,gas (J/mol*K) | Temperature (K) | Reference | Comment |
---|---|---|---|
41.05 | 50. | Thermodynamics Research Center, 1997 | p=1 bar. Calculated values of the thermodynamic functions [ Aston J.D., 1946, Kilpatrick J.E., 1946, Durig J.R., 1980, Thermodynamics Research Center, 1997] show some disagreement between authors as well as with experimental data [ Aston J.D., 1946, 2, Wacker P.F., 1947] (up to 3-4 J/mol*K). More reliable experimental data are required to solve available inconsistency.; GT |
48.05 | 100. | ||
56.41 | 150. | ||
65.19 | 200. | ||
80.03 | 273.15 | ||
85.56 | 298.15 | ||
85.98 | 300. | ||
108.48 | 400. | ||
129.06 | 500. | ||
146.75 | 600. | ||
161.88 | 700. | ||
174.91 | 800. | ||
186.21 | 900. | ||
196.02 | 1000. | ||
204.55 | 1100. | ||
211.96 | 1200. | ||
218.41 | 1300. | ||
224.02 | 1400. | ||
228.91 | 1500. | ||
238.64 | 1750. | ||
245.70 | 2000. | ||
250.92 | 2250. | ||
254.85 | 2500. | ||
257.85 | 2750. | ||
260.16 | 3000. |
Constant pressure heat capacity of gas
Cp,gas (J/mol*K) | Temperature (K) | Reference | Comment |
---|---|---|---|
89.58 ± 0.06 | 313.55 | Wacker P.F., 1947 | GT |
101.21 ± 0.07 | 363.25 |

Condensed phase thermochemistry data

Data compiled by: Eugene S. Domalski and Elizabeth D. Hearing
Quantity | Value | Units | Method | Reference | Comment |
---|---|---|---|---|---|
S°liquid | 229.06 | J/mol*K | N/A | Takeda, Yamamuro, et al., 1991 | |
S°liquid | 227.0 | J/mol*K | N/A | Chao, Hall, et al., 1983 | |
S°liquid | 213.84 | J/mol*K | N/A | Aston, Fink, et al., 1946 |
Constant pressure heat capacity of liquid
Cp,liquid (J/mol*K) | Temperature (K) | Reference | Comment |
---|---|---|---|
128.96 | 298.15 | Takeda, Yamamuro, et al., 1991 | T = 5 to 300 K. |
118. | 298.15 | Chao, Hall, et al., 1983 | T = 12 to 360 K. |
128.6 | 294. | Schlinger and Sage, 1949 | T = 294 to 378 K. Cp given as 0.548 Btu/lb*R at 70°F at bubble point. |
119.45 | 260. | Aston, Fink, et al., 1946 | T = 11.5 to 260 K. |
119.16 | 253.4 | Todd and Parks, 1936 | T = 81 to 253 K. Value is unsmoothed experimental datum. |

Phase change data

Data compiled as indicated in comments:
BS - Robert L. Brown and Stephen E. Stein
TRC - Thermodynamics Research Center, NIST Boulder Laboratories, Chris Muzny director
AC - William E. Acree, Jr., James S. Chickos
DH - Eugene S. Domalski and Elizabeth D. Hearing
ALS - Hussein Y. Afeefy, Joel F. Liebman, and Stephen E. Stein
Quantity | Value | Units | Method | Reference | Comment |
---|---|---|---|---|---|
Tboil | 266.8 ± 0.5 | K | AVG | N/A | Average of 15 out of 17 values; Individual data points |
Quantity | Value | Units | Method | Reference | Comment |
Ttriple | 87.800 | K | N/A | Takeda, Yamamuro, et al., 1991, 2 | Uncertainty assigned by TRC = 0.005 K; TRC |
Ttriple | 87.82 | K | N/A | Chao, Hall, et al., 1983, 2 | Uncertainty assigned by TRC = 0.02 K; TRC |
Ttriple | 87.8 | K | N/A | Aston, Finke, et al., 1946 | Uncertainty assigned by TRC = 0.05 K; TRC |
Ttriple | 87.83 | K | N/A | Aston, Finke, et al., 1946 | Uncertainty assigned by TRC = 0.05 K; TRC |
Quantity | Value | Units | Method | Reference | Comment |
Tc | 419.5 ± 0.5 | K | N/A | Tsonopoulos and Ambrose, 1996 | |
Tc | 419.6 | K | N/A | Majer and Svoboda, 1985 | |
Tc | 417.15 | K | N/A | Coffin and Maass, 1928 | Uncertainty assigned by TRC = 2. K; TRC |
Quantity | Value | Units | Method | Reference | Comment |
Pc | 40.2 ± 0.5 | bar | N/A | Tsonopoulos and Ambrose, 1996 | |
Quantity | Value | Units | Method | Reference | Comment |
Vc | 0.2408 | l/mol | N/A | Tsonopoulos and Ambrose, 1996 | |
Quantity | Value | Units | Method | Reference | Comment |
ρc | 4.15 ± 0.05 | mol/l | N/A | Tsonopoulos and Ambrose, 1996 | |
Quantity | Value | Units | Method | Reference | Comment |
ΔvapH° | 20.88 | kJ/mol | N/A | Majer and Svoboda, 1985 | |
ΔvapH° | 20.1 | kJ/mol | N/A | Reid, 1972 | AC |
Enthalpy of vaporization
ΔvapH (kJ/mol) | Temperature (K) | Method | Reference | Comment |
---|---|---|---|---|
21.866 | 266.91 | N/A | Aston, Fink, et al., 1946 | P = 101.325 kPa; DH |
22.07 | 266.9 | N/A | Majer and Svoboda, 1985 | |
23.3 | 259. | A | Stephenson and Malanowski, 1987 | Based on data from 200. to 274. K.; AC |
28.3 | 177. | A | Stephenson and Malanowski, 1987 | Based on data from 126. to 192. K.; AC |
22.8 | 282. | A | Stephenson and Malanowski, 1987 | Based on data from 267. to 345. K.; AC |
22.0 | 357. | A | Stephenson and Malanowski, 1987 | Based on data from 342. to 411. K.; AC |
22.5 | 282. | A | Stephenson and Malanowski, 1987 | Based on data from 267. to 411. K.; AC |
23.701 | 202. | C | Aston, Fink, et al., 1946 | ALS |
25.3 | 202. | N/A | Aston, Fink, et al., 1946 | AC |
24.5 | 219. | N/A | Aston, Fink, et al., 1946 | AC |
23.3 | 242. | N/A | Aston, Fink, et al., 1946 | AC |
21.9 | 267. | N/A | Aston, Fink, et al., 1946 | AC |
23.2 | 258. | N/A | Lamb and Roper, 1940 | Based on data from 216. to 273. K. See also Boublik, Fried, et al., 1984.; AC |
Enthalpy of vaporization
ΔvapH = A exp(-αTr)
(1 − Tr)β
ΔvapH =
Enthalpy of vaporization (at saturation pressure)
(kJ/mol)
Tr = reduced temperature (T / Tc)
View plot Requires a JavaScript / HTML 5 canvas capable browser.
Temperature (K) | 203. to 378. |
---|---|
A (kJ/mol) | 32.51 |
α | 0.0052 |
β | 0.38 |
Tc (K) | 419.6 |
Reference | Majer and Svoboda, 1985 |
Entropy of vaporization
ΔvapS (J/mol*K) | Temperature (K) | Reference | Comment |
---|---|---|---|
81.92 | 266.91 | Aston, Fink, et al., 1946 | P; DH |
Antoine Equation Parameters
log10(P) = A − (B / (T + C))
P = vapor pressure (bar)
T = temperature (K)
View plot Requires a JavaScript / HTML 5 canvas capable browser.
Temperature (K) | A | B | C | Reference | Comment |
---|---|---|---|---|---|
195.7 to 269.4 | 4.24696 | 1099.207 | -8.256 | Coffin and Maass, 1928, 2 | Coefficents calculated by NIST from author's data. |
Enthalpy of fusion
ΔfusH (kJ/mol) | Temperature (K) | Reference | Comment |
---|---|---|---|
3.9586 | 87.81 | Takeda, Yamamuro, et al., 1991 | DH |
3.848 | 87.82 | Chao, Hall, et al., 1983 | DH |
3.849 | 87.82 | Aston, Fink, et al., 1946 | DH |
3.85 | 87.8 | Domalski and Hearing, 1996 | AC |
Entropy of fusion
ΔfusS (J/mol*K) | Temperature (K) | Reference | Comment |
---|---|---|---|
45.09 | 87.81 | Takeda, Yamamuro, et al., 1991 | DH |
43.8 | 87.82 | Chao, Hall, et al., 1983 | DH |
43.83 | 87.82 | Aston, Fink, et al., 1946 | DH |

Reaction thermochemistry data

Data compiled as indicated in comments:
ALS - Hussein Y. Afeefy, Joel F. Liebman, and Stephen E. Stein
B - John E. Bartmess
Individual Reactions
By formula: C4H8 = C4H8
Quantity | Value | Units | Method | Reference | Comment |
---|---|---|---|---|---|
ΔrH° | -12.6 ± 0.84 | kJ/mol | Eqk | Meyer and Stroz, 1972 | gas phase; Reanalyzed by Cox and Pilcher, 1970, Original value = -11.0 kJ/mol; At 300 K; ALS |
ΔrH° | -12.4 ± 1.7 | kJ/mol | Eqk | Happel, Hnatow, et al., 1971 | gas phase; ALS |
ΔrH° | -12.7 | kJ/mol | Eqk | Maccoll and Ross, 1965 | gas phase; GC; ALS |
ΔrH° | -11.7 ± 0.84 | kJ/mol | Eqk | Golden, Egger, et al., 1964 | gas phase; ALS |
ΔrH° | -11.5 | kJ/mol | Ciso | Levanova and Andreevskii, 1964 | gas phase; At 420.3 K; ALS |
C4H7- + =
Quantity | Value | Units | Method | Reference | Comment |
---|---|---|---|---|---|
ΔrH° | 1724. ± 8.4 | kJ/mol | Bran | DePuy, Gronert, et al., 1989 | gas phase; B |
ΔrH° | 1729. ± 20. | kJ/mol | Bran | Peerboom, Rademaker, et al., 1992 | gas phase; B |
Quantity | Value | Units | Method | Reference | Comment |
ΔrG° | 1690. ± 8.8 | kJ/mol | H-TS | DePuy, Gronert, et al., 1989 | gas phase; B |
ΔrG° | 1695. ± 21. | kJ/mol | H-TS | Peerboom, Rademaker, et al., 1992 | gas phase; B |
By formula: C4H8 + Br2 = C4H8Br2
Quantity | Value | Units | Method | Reference | Comment |
---|---|---|---|---|---|
ΔrH° | -120.9 | kJ/mol | Cm | Lister, 1941 | gas phase; Heat of bromination at 300 K; ALS |
ΔrH° | -123.2 ± 0.84 | kJ/mol | Cm | Conn, Kistiakowsky, et al., 1938 | gas phase; Reanalyzed by Cox and Pilcher, 1970, Original value = -123.8 ± 0.84 kJ/mol; At 355 °K; ALS |
By formula: HBr + C4H8 = C4H9Br
Quantity | Value | Units | Method | Reference | Comment |
---|---|---|---|---|---|
ΔrH° | -83.85 ± 0.50 | kJ/mol | Cm | Lacher, Billings, et al., 1952 | gas phase; Reanalyzed by Cox and Pilcher, 1970, Original value = -84.3 ± 7.5 kJ/mol; Heat of hydrobromination at 367 K; ALS |
C4H7- + =
Quantity | Value | Units | Method | Reference | Comment |
---|---|---|---|---|---|
ΔrH° | 1707. ± 15. | kJ/mol | CIDT | Graul and Squires, 1990 | gas phase; B |
Quantity | Value | Units | Method | Reference | Comment |
ΔrG° | 1674. ± 15. | kJ/mol | H-TS | Graul and Squires, 1990 | gas phase; B |
By formula: C4H8 = C4H8
Quantity | Value | Units | Method | Reference | Comment |
---|---|---|---|---|---|
ΔrH° | -10.6 ± 2.1 | kJ/mol | Eqk | Happel, Hnatow, et al., 1971 | gas phase; ALS |
ΔrH° | -8.16 | kJ/mol | Ciso | Levanova and Andreevskii, 1964 | gas phase; At 420.3 K; ALS |
By formula: C4H8I2 = C4H8 + I2
Quantity | Value | Units | Method | Reference | Comment |
---|---|---|---|---|---|
ΔrH° | 50.2 ± 6.3 | kJ/mol | Cm | Cline and Kistiakowsky, 1937 | gas phase; Heat of formation derived by Cox and Pilcher, 1970; ALS |
Quantity | Value | Units | Method | Reference | Comment |
---|---|---|---|---|---|
ΔrH° | -125.9 ± 0.42 | kJ/mol | Chyd | Kistiakowsky, Ruhoff, et al., 1935 | gas phase; At 355 °K; ALS |
By formula: C4H9Cl = C4H8 + HCl
Quantity | Value | Units | Method | Reference | Comment |
---|---|---|---|---|---|
ΔrH° | 75.31 | kJ/mol | Eqk | Levanova and Andreevskii, 1964 | gas phase; At 420 K; ALS |
By formula: C4H8 + I2 = C4H8I2
Quantity | Value | Units | Method | Reference | Comment |
---|---|---|---|---|---|
ΔrH° | -50.2 ± 6.3 | kJ/mol | Cm | Cline and Kistiakowsky, 1937 | gas phase; ALS |
By formula: C10H14O = C4H8 + C6H6O
Quantity | Value | Units | Method | Reference | Comment |
---|---|---|---|---|---|
ΔrH° | 77.8 | kJ/mol | Cm | Kukui, Potolovskii, et al., 1973 | liquid phase; ALS |
By formula: C10H14O = C4H8 + C6H6O
Quantity | Value | Units | Method | Reference | Comment |
---|---|---|---|---|---|
ΔrH° | 82.8 | kJ/mol | Cm | Kukui, Potolovskii, et al., 1973 | liquid phase; ALS |

Henry's Law data

Data compiled by: Rolf Sander
Henry's Law constant (water solution)
kH(T) = k°H exp(d(ln(kH))/d(1/T) ((1/T) - 1/(298.15 K)))
k°H = Henry's law constant for solubility in water at 298.15 K (mol/(kg*bar))
d(ln(kH))/d(1/T) = Temperature dependence constant (K)
k°H (mol/(kg*bar)) | d(ln(kH))/d(1/T) (K) | Method | Reference | Comment |
---|---|---|---|---|
0.0040 | Q | N/A | missing citation give several references for the Henry's law constants but don't assign them to specific species. | |
0.0014 | L | N/A | ||
0.013 | 6400. | L | N/A | |
0.0040 | V | N/A |

Gas phase ion energetics data

Data evaluated as indicated in comments:
L - Sharon G. Lias
Data compiled as indicated in comments:
B - John E. Bartmess
LL - Sharon G. Lias and Joel F. Liebman
LBLHLM - Sharon G. Lias, John E. Bartmess, Joel F. Liebman, John L. Holmes, Rhoda D. Levin, and W. Gary Mallard
LLK - Sharon G. Lias, Rhoda D. Levin, and Sherif A. Kafafi
RDSH - Henry M. Rosenstock, Keith Draxl, Bruce W. Steiner, and John T. Herron
Quantity | Value | Units | Method | Reference | Comment |
---|---|---|---|---|---|
IE (evaluated) | 9.55 ± 0.06 | eV | N/A | N/A | L |
Ionization energy determinations
IE (eV) | Method | Reference | Comment |
---|---|---|---|
9.55 ± 0.06 | PIPECO | Van der Meij, Van Eck, et al., 1989 | LL |
9.57 | PI | Traeger, 1986 | LBLHLM |
9.58 | PI | Traeger, 1984 | LBLHLM |
9.62 ± 0.05 | EI | Holmes and Lossing, 1983 | LBLHLM |
9.59 ± 0.02 | PI | Wood and Taylor, 1979 | LLK |
9.63 ± 0.02 | PE | Bieri, Burger, et al., 1977 | LLK |
9.625 ± 0.003 | PE | Masclet, Grosjean, et al., 1973 | LLK |
9.58 | EI | Lossing, 1972 | LLK |
9.59 | PE | Dewar and Worley, 1969 | RDSH |
9.62 | CI | Cermak, 1968 | RDSH |
9.61 ± 0.02 | PI | Steiner, Giese, et al., 1961 | RDSH |
9.58 ± 0.01 | PI | Watanabe, 1957 | RDSH |
9.77 ± 0.01 | PE | Krause, Taylor, et al., 1978 | Vertical value; LLK |
10.0 | PE | White, Carlson, et al., 1974 | Vertical value; LLK |
9.72 | PE | Mollere, Bock, et al., 1972 | Vertical value; LLK |
Appearance energy determinations
Ion | AE (eV) | Other Products | Method | Reference | Comment |
---|---|---|---|---|---|
CH3+ | 14.1 | C3H5 | EI | SenSharma and Franklin, 1973 | LLK |
C2H3+ | 13.6 | ? | EI | Omura, 1962 | RDSH |
C2H4+ | 11.65 ± 0.06 | C2H4 | PIPECO | Van der Meij, Van Eck, et al., 1989 | LL |
C2H4+ | 11.7 ± 0.2 | ? | EI | Meisels, Park, et al., 1970 | RDSH |
C2H5+ | 14.22 ± 0.06 | C2H3 | PIPECO | Van der Meij, Van Eck, et al., 1989 | LL |
C3H3+ | 14.07 ± 0.10 | H2+CH3 | PIPECO | Van der Meij, Van Eck, et al., 1989 | LL |
C3H3+ | 13.82 | ? | EI | Omura, 1961 | RDSH |
C3H5+ | 11.36 ± 0.06 | CH3 | PIPECO | Van der Meij, Van Eck, et al., 1989 | LL |
C3H5+ | 11.20 | CH3 | PI | Traeger, 1984 | LBLHLM |
C3H5+ | 11.8 | CH3 | EI | SenSharma and Franklin, 1973 | LLK |
C3H5+ | 11.28 | CH3 | EI | Lossing, 1971 | LLK |
C4H5+ | 14.33 ± 0.07 | H2+H | PIPECO | Van der Meij, Van Eck, et al., 1989 | LL |
C4H7+ | 11.17 ± 0.06 | H | PIPECO | Van der Meij, Van Eck, et al., 1989 | LL |
C4H7+ | 11.13 | H | PI | Traeger, 1986 | LBLHLM |
C4H7+ | 11.26 | H | EI | Lossing, 1972 | LLK |
De-protonation reactions
C4H7- + =
Quantity | Value | Units | Method | Reference | Comment |
---|---|---|---|---|---|
ΔrH° | 1724. ± 8.4 | kJ/mol | Bran | DePuy, Gronert, et al., 1989 | gas phase; B |
ΔrH° | 1729. ± 20. | kJ/mol | Bran | Peerboom, Rademaker, et al., 1992 | gas phase; B |
Quantity | Value | Units | Method | Reference | Comment |
ΔrG° | 1690. ± 8.8 | kJ/mol | H-TS | DePuy, Gronert, et al., 1989 | gas phase; B |
ΔrG° | 1695. ± 21. | kJ/mol | H-TS | Peerboom, Rademaker, et al., 1992 | gas phase; B |
C4H7- + =
Quantity | Value | Units | Method | Reference | Comment |
---|---|---|---|---|---|
ΔrH° | 1707. ± 15. | kJ/mol | CIDT | Graul and Squires, 1990 | gas phase; B |
Quantity | Value | Units | Method | Reference | Comment |
ΔrG° | 1674. ± 15. | kJ/mol | H-TS | Graul and Squires, 1990 | gas phase; B |

Kovats' RI, non-polar column, isothermal

Column type | Active phase | Temperature (C) | I | Reference | Comment |
---|---|---|---|---|---|
Capillary | BPX-5 | 30. | 394. | Aflalaye, Sternberg, et al., 1995 | 12. m/0.15 mm/0.25 μm, H2 |
Capillary | BPX-5 | 30. | 394. | Aflalaye, Sternberg, et al., 1995 | 12. m/0.15 mm/0.25 μm, H2 |
Capillary | CP Sil 5 CB | 20. | 391. | Do and Raulin, 1992 | 25. m/0.15 mm/2. μm, H2 |
Capillary | PoraPLOT Q | 100. | 389. | Do and Raulin, 1989 | 10. m/0.32 mm/10. μm, H2 |
Capillary | PoraPLOT Q | 160. | 390. | Do and Raulin, 1989 | 10. m/0.32 mm/10. μm, H2 |
Capillary | OV-1 | 100. | 388.7 | Anders, Anders, et al., 1985 | 55. m/0.21 mm/0.35 μm, N2 |
Capillary | HP-PONA | 40. | 391. | Lubeck and Sutton, 1984 | 50. m/0.21 mm/0.5 μm, H2 |
Capillary | SE-30 | 60. | 390. | Bredael, 1982 | Column length: 100. m; Column diameter: 0.5 mm |
Capillary | OV-1 | 20. | 386. | Nijs and Jacobs, 1981 | He; Column length: 150. m; Column diameter: 0.50 mm |
Capillary | Squalane | 50. | 384.4 | Schröder, 1980 | |
Packed | Squalane | 80. | 384. | Chrétien and Dubois, 1977 | |
Capillary | Squalane | 100. | 395. | Lulova, Leont'eva, et al., 1976 | He; Column length: 120. m; Column diameter: 0.25 mm |
Capillary | Squalane | 40. | 385. | Matukuma, 1969 | N2; Column length: 91.4 m; Column diameter: 0.25 mm |
Packed | Squalane | 27. | 385. | Hively and Hinton, 1968 | He, Chromosorb P; Column length: 15. m; Column diameter: 0.25 mm |
Packed | Squalane | 49. | 385. | Hively and Hinton, 1968 | He, Chromosorb P; Column length: 15. m; Column diameter: 0.25 mm |
Packed | Squalane | 67. | 385. | Hively and Hinton, 1968 | He, Chromosorb P; Column length: 15. m; Column diameter: 0.25 mm |
Packed | Squalane | 86. | 385. | Hively and Hinton, 1968 | He, Chromosorb P; Column length: 15. m; Column diameter: 0.25 mm |
Packed | SE-30 | 70. | 393. | Widmer, 1967 | Diatoport S; Column length: 7.9 m |
Packed | Squalane | 26. | 385. | Zulaïca and Guiochon, 1966 | Column length: 10. m |

Kovats' RI, non-polar column, custom temperature program

Column type | Active phase | I | Reference | Comment |
---|---|---|---|---|
Capillary | Petrocol DH-100 | 389.2 | Haagen-Smit Laboratory, 1997 | He; Column length: 100. m; Column diameter: 0.2 mm; Program: 5C(10min) => 5C/min => 50C(48min) => 1.5C/min => 195C(91min) |
Capillary | DB-1 | 392. | Hoekman, 1993 | 60. m/0.32 mm/1.0 μm, He; Program: -40 C for 12 min; -40 - 125 C at 3 deg.min; 125-185 C at 6 deg/min; 185 - 220 C at 20 deg/min; hold 220 C for 2 min |

Kovats' RI, polar column, isothermal

Column type | Active phase | Temperature (C) | I | Reference | Comment |
---|---|---|---|---|---|
Packed | Carbowax 20M | 130. | 436. | Widmer, 1967 | Diatoport P; Column length: 7.9 m |
Packed | Carbowax 20M | 70. | 426. | Widmer, 1967 | Diatoport P; Column length: 7.9 m |

Van Den Dool and Kratz RI, non-polar column, temperature ramp

Column type | Active phase | I | Reference | Comment |
---|---|---|---|---|
Capillary | Petrocol DH | 386. | White, Hackett, et al., 1992 | 100. m/0.25 mm/0.5 μm, He, 1. K/min; Tstart: 30. C; Tend: 220. C |
Capillary | Chromosorb 101 | 400. | Voorhees, Hileman, et al., 1975 | 10. K/min; Tstart: 0. C; Tend: 220. C |

Van Den Dool and Kratz RI, non-polar column, custom temperature program

Column type | Active phase | I | Reference | Comment |
---|---|---|---|---|
Packed | SE-30 | 388. | Peng, Ding, et al., 1988 | Supelcoport; Chromosorb; Column length: 3.05 m; Program: 40C(5min) => 10C/min => 200C or 250C (60min) |

Normal alkane RI, non-polar column, isothermal

Column type | Active phase | Temperature (C) | I | Reference | Comment |
---|---|---|---|---|---|
Capillary | OV-101 | 40. | 385. | Li and Deng, 1998 | N2; Column length: 51. m; Column diameter: 0.25 mm |
Capillary | SE-54 | 50. | 402. | Xieyun, Maoqi, et al., 1996 | N2; Column length: 40. m; Column diameter: 0.25 mm |
Packed | Methyl Silicone | 50. | 400. | Huguet, 1961 | Nitrogen, Celite C-22; Column length: 2.5 m |

Normal alkane RI, non-polar column, temperature ramp

Column type | Active phase | I | Reference | Comment |
---|---|---|---|---|
Capillary | Polydimethyl siloxane: CP-Sil 5 CB | 390. | Bramston-Cook, 2013 | 60. m/0.25 mm/1.0 μm, Helium, 45. C @ 1.45 min, 3.6 K/min, 210. C @ 2.72 min |
Capillary | Petrocol DH | 392. | Supelco, 2012 | 100. m/0.25 mm/0.50 μm, Helium, 20. C @ 15. min, 15. K/min, 220. C @ 30. min |
Capillary | Ultra-ALLOY-5 | 382. | Tsuge, Ohtan, et al., 2011 | 30. m/0.25 mm/0.25 μm, 40. C @ 2. min, 20. K/min, 320. C @ 13. min |
Capillary | Ultra-ALLOY-5 | 385. | Tsuge, Ohtan, et al., 2011 | 30. m/0.25 mm/0.25 μm, 40. C @ 2. min, 20. K/min, 320. C @ 13. min |
Capillary | Ultra-ALLOY-5 | 385. | Tsuge, Ohtan, et al., 2011 | 30. m/0.25 mm/0.25 μm, 40. C @ 2. min, 20. K/min, 320. C @ 13. min |
Capillary | Ultra-ALLOY-5 | 385. | Tsuge, Ohtan, et al., 2011 | 30. m/0.25 mm/0.25 μm, 40. C @ 2. min, 20. K/min, 320. C @ 13. min |
Capillary | Ultra-ALLOY-5 | 388. | Tsuge, Ohtan, et al., 2011 | 30. m/0.25 mm/0.25 μm, 40. C @ 2. min, 20. K/min, 320. C @ 13. min |
Capillary | DB-5MS | 386. | Shoenmakers, Oomen, et al., 2000 | 30. m/0.25 mm/0.25 μm, He, 40. C @ 1. min, 3. K/min; Tend: 250. C |
Capillary | OV-101 | 387. | Chupalov and Zenkevich, 1996 | N2, 3. K/min; Column length: 52. m; Column diameter: 0.26 mm; Tstart: 50. C; Tend: 220. C |
Capillary | DB-1 | 386. | Ciccioli, Cecinato, et al., 1992 | 60. m/0.32 mm/1.2 μm, He, 30. C @ 10. min, 3. K/min; Tend: 240. C |

Normal alkane RI, non-polar column, custom temperature program

Column type | Active phase | I | Reference | Comment |
---|---|---|---|---|
Capillary | Methyl Silicone | 390. | Blunden, Aneja, et al., 2005 | 60. m/0.32 mm/1.0 μm, Helium; Program: -50 0C (2 min) 8 0C/min -> 200 0C (7.75 min) 25 0C -> 225 0C (8 min) |
Capillary | Polydimethyl siloxane | 384. | Junkes, Castanho, et al., 2003 | Program: not specified |
Capillary | PONA | 391. | Perkin Elmer Instruments, 2002 | Column length: 100. m; Phase thickness: 0.50 μm; Program: not specified |
Capillary | Methyl Silicone | 383. | N/A | Program: not specified |
Capillary | Methyl Silicone | 387. | Zenkevich, 2000 | Program: not specified |
Capillary | Methyl Silicone | 386. | Spieksma, 1999 | Program: not specified |
Capillary | SPB-1 | 386. | Flanagan, Streete, et al., 1997 | 60. m/0.53 mm/5. μm, He; Program: 40C(6min) => 5C/min => 80C => 10C/min => 200C |
Capillary | Polydimethyl siloxanes | 387. | Zenkevich, 1997 | Program: not specified |
Capillary | Polydimethyl siloxanes | 387. | Zenkevich, Chupalov, et al., 1996 | Program: not specified |
Capillary | Methyl Silicone | 387. | Xu, Chu, et al., 1995 | Program: not specified |
Capillary | SPB-1 | 386. | Strete, Ruprah, et al., 1992 | 60. m/0.53 mm/5.0 μm, Helium; Program: 40 0C (6 min) 5 0C/min -> 80 0C 10 0C/min -> 200 0C |
Capillary | SPB-1 | 390. | Strete, Ruprah, et al., 1992 | 60. m/0.53 mm/5.0 μm, Helium; Program: not specified |
Capillary | OV-1 | 390. | Ramsey and Flanagan, 1982 | Program: not specified |
Packed | SE-30 | 392. | Robinson and Odell, 1971 | N2, Chromosorb W; Column length: 6.1 m; Program: 50C910min) => 20C/min => 90(6min) => 10C/min => 150C(hold) |

Normal alkane RI, polar column, custom temperature program

Column type | Active phase | I | Reference | Comment |
---|---|---|---|---|
Capillary | Carbowax 20M | 415. | Ramsey and Flanagan, 1982 | Program: not specified |

References

Prosen, Maron, et al., 1951
Prosen, E.J.; Maron, F.W.; Rossini, F.D.,
Heats of combustion, formation, and insomerization of ten C4 hydrocarbons,
J. Res. NBS, 1951, 46, 106-112. [all data]
Thermodynamics Research Center, 1997
Thermodynamics Research Center,
Selected Values of Properties of Chemical Compounds., Thermodynamics Research Center, Texas A&M University, College Station, Texas, 1997. [all data]
Aston J.D., 1946
Aston J.D.,
Thermodynamic properties of gaseous 1,3-butadiene and normal butenes above 25 C. Equilibria in the system 1,3-butadiene, n-butenes, and n-butane,
J. Chem. Phys., 1946, 14, 67-79. [all data]
Kilpatrick J.E., 1946
Kilpatrick J.E.,
Heat content, free energy function, entropy, and heat capacity of ethylene, propylene, and the four butenes to 1500 K,
J. Res. Nat. Bur. Stand, 1946, 37, 163-171. [all data]
Durig J.R., 1980
Durig J.R.,
Spectroscopic and thermodynamic study of conformational properties and torsional potential functions of 1-butene,
J. Phys. Chem., 1980, 84, 773-781. [all data]
Aston J.D., 1946, 2
Aston J.D.,
The heat capacity and entropy, heats of fusion and vaporization and the vapor pressure of butene-1. The zero point entropy of the glass. The entropy of the gas from molecular data,
J. Am. Chem. Soc., 1946, 68, 52-57. [all data]
Wacker P.F., 1947
Wacker P.F.,
Heat capacities of gaseous oxygen, isobutane, and 1-butene from -30 to +90 C,
J. Res. Nat. Bur. Stand., 1947, 38, 651-659. [all data]
Takeda, Yamamuro, et al., 1991
Takeda, K.; Yamamuro, O.; Suga, H.,
Thermodynamic study of 1-butene. Exothermic and endothermic enthalpy relaxations near the glass transition,
J. Phys. Chem. Solids, 1991, 22, 607-615. [all data]
Chao, Hall, et al., 1983
Chao, J.; Hall, K.R.; Yao, J.M.,
Thermodynamic properties of simple alkenes,
Thermochim. Acta, 1983, 64(3), 285-303. [all data]
Aston, Fink, et al., 1946
Aston, J.G.; Fink, H.L.; Bestul, A.B.; Pace, E.L.; Szasz, G.J.,
The heat capacity and entropy, heats of fusion and vaporization and the vapor pressure of butene-1. The zero point entropy of the glass. The entropy of the gas from molecular data,
J. Am. Chem. Soc., 1946, 68, 52-57. [all data]
Schlinger and Sage, 1949
Schlinger, W.G.; Sage, B.H.,
Isobaric heat capacity of 1-butene and 1-pentene at bubble point,
Ind. Eng. Chem., 1949, 41, 1779-1782. [all data]
Todd and Parks, 1936
Todd, S.S.; Parks, G.S.,
Thermal data on organic compounds. XV. Some heat capacity, entropy and free energy data for the isomeric butenes,
J. Am. Chem. Soc., 1936, 58, 134-137. [all data]
Takeda, Yamamuro, et al., 1991, 2
Takeda, K.; Yamamuro, O.; Suga, H.,
Thermodynamic study of 1-butene. Exothermic and endothermic enthalpy relaxations near the glass transition,
J. Phys. Chem. Solids, 1991, 52, 607. [all data]
Chao, Hall, et al., 1983, 2
Chao, J.; Hall, K.R.; Yao, J.M.,
Thermodynamic Properties of Simple Alkenes,
Thermochim. Acta, 1983, 64, 285. [all data]
Aston, Finke, et al., 1946
Aston, J.G.; Finke, H.L.; Bestul, A.B.; Pace, E.L.; Szasz, G.J.,
The Heat Capacity and Entropy, Heats of Fusion and Vaporization and the Vapor Pressure of Butene-1. The Zero Point Entropy of the Glass. The Entropy of the Gas from Molecular Data,
J. Am. Chem. Soc., 1946, 68, 52. [all data]
Tsonopoulos and Ambrose, 1996
Tsonopoulos, C.; Ambrose, D.,
Vapor-Liquid Critical Properties of Elements and Compounds. 6. Unsaturated Aliphatic Hydrocarbons,
J. Chem. Eng. Data, 1996, 41, 645-656. [all data]
Majer and Svoboda, 1985
Majer, V.; Svoboda, V.,
Enthalpies of Vaporization of Organic Compounds: A Critical Review and Data Compilation, Blackwell Scientific Publications, Oxford, 1985, 300. [all data]
Coffin and Maass, 1928
Coffin, C.C.; Maass, O.,
The Preparation and Physical Properties of α-,β- and γ-Butylene and Normal and Isobutane,
J. Am. Chem. Soc., 1928, 50, 1427-37. [all data]
Reid, 1972
Reid, Robert C.,
Handbook on vapor pressure and heats of vaporization of hydrocarbons and related compounds, R. C. Wilhort and B. J. Zwolinski, Texas A Research Foundation. College Station, Texas(1971). 329 pages.$10.00,
AIChE J., 1972, 18, 6, 1278-1278, https://doi.org/10.1002/aic.690180637
. [all data]
Stephenson and Malanowski, 1987
Stephenson, Richard M.; Malanowski, Stanislaw,
Handbook of the Thermodynamics of Organic Compounds, 1987, https://doi.org/10.1007/978-94-009-3173-2
. [all data]
Lamb and Roper, 1940
Lamb, Arthur B.; Roper, Edwin E.,
The Vapor Pressures of Certain Unsaturated Hydrocarbons,
J. Am. Chem. Soc., 1940, 62, 4, 806-814, https://doi.org/10.1021/ja01861a032
. [all data]
Boublik, Fried, et al., 1984
Boublik, T.; Fried, V.; Hala, E.,
The Vapour Pressures of Pure Substances: Selected Values of the Temperature Dependence of the Vapour Pressures of Some Pure Substances in the Normal and Low Pressure Region, 2nd ed., Elsevier, New York, 1984, 972. [all data]
Coffin and Maass, 1928, 2
Coffin, C.C.; Maass, O.,
The Preparation and Physical Properties of α, β- and γ-Butylene and Normal and Isobutane,
J. Am. Chem. Soc., 1928, 50, 5, 1427-1437, https://doi.org/10.1021/ja01392a028
. [all data]
Domalski and Hearing, 1996
Domalski, Eugene S.; Hearing, Elizabeth D.,
Heat Capacities and Entropies of Organic Compounds in the Condensed Phase. Volume III,
J. Phys. Chem. Ref. Data, 1996, 25, 1, 1, https://doi.org/10.1063/1.555985
. [all data]
Meyer and Stroz, 1972
Meyer, E.F.; Stroz, D.G.,
Thermodynamics of n-butene isomerization,
J. Am. Chem. Soc., 1972, 94, 6344-6347. [all data]
Cox and Pilcher, 1970
Cox, J.D.; Pilcher, G.,
Thermochemistry of Organic and Organometallic Compounds, Academic Press, New York, 1970, 1-636. [all data]
Happel, Hnatow, et al., 1971
Happel, J.; Hnatow, M.A.; Mezaki, R.,
Isomerization equilibrium constants of n-butenes,
J. Chem. Eng. Data, 1971, 16, 206-209. [all data]
Maccoll and Ross, 1965
Maccoll, A.; Ross, R.A.,
The hydrogen bromide catalyzed isomerization of n-butenes. I. equilibrium values,
J. Am. Chem. Soc., 1965, 87, 1169-1170. [all data]
Golden, Egger, et al., 1964
Golden, D.M.; Egger, K.W.; Benson, S.W.,
Iodine-catalyzed isomerization of olefins. I. Thermodynamics data from equilibrium studies of positional and geometrical isomerization of 1-butene and 2-butene,
J. Am. Chem. Soc., 1964, 86, 5416-5420. [all data]
Levanova and Andreevskii, 1964
Levanova, S.V.; Andreevskii, D.N.,
The equilibrium of 2-chlorobutane dehydrochlorination,
Neftekhimiya, 1964, 4, 329-336. [all data]
DePuy, Gronert, et al., 1989
DePuy, C.H.; Gronert, S.; Barlow, S.E.; Bierbaum, V.M.; Damrauer, R.,
The Gas Phase Acidities of the Alkanes,
J. Am. Chem. Soc., 1989, 111, 6, 1968, https://doi.org/10.1021/ja00188a003
. [all data]
Peerboom, Rademaker, et al., 1992
Peerboom, R.A.L.; Rademaker, G.J.; Dekoning, L.J.; Nibbering, N.M.M.,
Stabilization of Cycloalkyl Carbanions in the Gas Phase,
Rapid Commun. Mass Spectrom., 1992, 6, 6, 394, https://doi.org/10.1002/rcm.1290060608
. [all data]
Lister, 1941
Lister, M.W.,
Heats of organic reactions. X. Heats of bromination of cyclic olefins,
J. Am. Chem. Soc., 1941, 63, 143-149. [all data]
Conn, Kistiakowsky, et al., 1938
Conn, J.B.; Kistiakowsky, G.B.; Smith, E.A.,
Heats of organic reactions. VII. Addition of halogens to olefins,
J. Am. Chem. Soc., 1938, 60, 2764-2771. [all data]
Lacher, Billings, et al., 1952
Lacher, J.R.; Billings, T.J.; Campion, D.E.,
Vapor phase heats of hydrobromination of the isomeric butenes,
J. Am. Chem. Soc., 1952, 74, 5291-52. [all data]
Graul and Squires, 1990
Graul, S.T.; Squires, R.R.,
Gas-Phase Acidities Derived from Threshold Energies for Activated Reactions,
J. Am. Chem. Soc., 1990, 112, 7, 2517, https://doi.org/10.1021/ja00163a007
. [all data]
Cline and Kistiakowsky, 1937
Cline, J.E.; Kistiakowsky, G.B.,
The gaseous equilibrium of 1,2-diiodobutane, butene-1 and iodine,
J. Chem. Phys., 1937, 5, 990. [all data]
Kistiakowsky, Ruhoff, et al., 1935
Kistiakowsky, G.B.; Ruhoff, J.R.; Smith, H.A.; Vaughan, W.E.,
Heats of organic reactions. II. Hydrogenation of some simpler olefinic hydrocarbons,
J. Am. Chem. Soc., 1935, 57, 876-882. [all data]
Kukui, Potolovskii, et al., 1973
Kukui, N.M.; Potolovskii, L.A.; Vasileva, V.N.,
Thermochemical and thermodynamic calculation of the alkylation of phenol by normal α-olefins,
Khim. Tekhnol. Topl. Masel, 1973, 18, 10-13. [all data]
Van der Meij, Van Eck, et al., 1989
Van der Meij, C.E.; Van Eck, J.; Niehaus, A.,
The decomposition of C4H8 complexes at controlled internal energies,
Chem. Phys., 1989, 130, 325. [all data]
Traeger, 1986
Traeger, J.C.,
Heat of formation for the 1-methylallyl cation by photoionization mass spectrometry,
J. Phys. Chem., 1986, 90, 4114. [all data]
Traeger, 1984
Traeger, J.C.,
A study of the allyl cation thermochemistry by photoionization mass spectrometry,
Int. J. Mass Spectrom. Ion Processes, 1984, 58, 259. [all data]
Holmes and Lossing, 1983
Holmes, J.L.; Lossing, F.P.,
The need for adequate thermochemical data for the interpretation of fragmentation mechanisms and ion structure assignments,
Int. J. Mass Spectrom. Ion Phys., 1983, 47, 133. [all data]
Wood and Taylor, 1979
Wood, K.V.; Taylor, J.W.,
A photoionization mass spectrometric study of autoionization in ethylene and trans-2-butene,
Int. J. Mass Spectrom. Ion Phys., 1979, 30, 307. [all data]
Bieri, Burger, et al., 1977
Bieri, G.; Burger, F.; Heilbronner, E.; Maier, J.P.,
Valence ionization enrgies of hydrocarbons,
Helv. Chim. Acta, 1977, 60, 2213. [all data]
Masclet, Grosjean, et al., 1973
Masclet, P.; Grosjean, D.; Mouvier, G.,
Alkene ionization potentials. Part I. Quantitative determination of alkyl group structural effects,
J. Electron Spectrosc. Relat. Phenom., 1973, 2, 225. [all data]
Lossing, 1972
Lossing, F.P.,
Free radicals by mass spectrometry. XLV. Ionization potentials and heats of formation of C3H3, C3H5, and C4H7 radicals and ions,
Can. J. Chem., 1972, 50, 3973. [all data]
Dewar and Worley, 1969
Dewar, M.J.S.; Worley, S.D.,
Photoelectron spectra of molecules. I. Ionization potentials of some organic molecules and their interpretation,
J. Chem. Phys., 1969, 50, 654. [all data]
Cermak, 1968
Cermak, V.,
Penning ionization electron spectroscopy,
Advan. Mass Spectrom., 1968, 4, 697. [all data]
Steiner, Giese, et al., 1961
Steiner, B.; Giese, C.F.; Inghram, M.G.,
Photoionization of alkanes. Dissociation of excited molecular ions,
J. Chem. Phys., 1961, 34, 189. [all data]
Watanabe, 1957
Watanabe, K.,
Ionization potentials of some molecules,
J. Chem. Phys., 1957, 26, 542. [all data]
Krause, Taylor, et al., 1978
Krause, D.A.; Taylor, J.W.; Fenske, R.F.,
An analysis of the effects of alkyl substituents on the ionization potentials of n-alkenes,
J. Am. Chem. Soc., 1978, 100, 718. [all data]
White, Carlson, et al., 1974
White, R.M.; Carlson, T.A.; Spears, D.P.,
Angular distribution of the photoelectron spectra for ethylene, propylene, butene and butadiene,
J. Electron Spectrosc. Relat. Phenom., 1974, 3, 59. [all data]
Mollere, Bock, et al., 1972
Mollere, P.; Bock, H.; Becker, G.; Fritz, G.,
Photoelectron spectra and molecular properties. XV. The effects of α- and β-silyl substituents on π-systems,
J. Organomet. Chem., 1972, 46, 89. [all data]
SenSharma and Franklin, 1973
SenSharma, D.K.; Franklin, J.L.,
Heat of formation of free radicals by mass spectrometry,
J. Am. Chem. Soc., 1973, 95, 6562. [all data]
Omura, 1962
Omura, I.,
Study on unimolecular decomposition of excited olefin ions,
Bull. Chem. Soc. Japan, 1962, 35, 1845. [all data]
Meisels, Park, et al., 1970
Meisels, G.G.; Park, J.Y.; Giessner, B.G.,
Ionization and dissociation of C4H8 isomers,
J. Am. Chem. Soc., 1970, 92, 254. [all data]
Omura, 1961
Omura, I.,
Mass spectra at low ionizing voltage and bond dissociation energies of molecular ions from hydrocarbons,
Bull. Chem. Soc. Japan, 1961, 34, 1227. [all data]
Lossing, 1971
Lossing, F.P.,
Free radicals by mass spectrometry. XLIII. Ionization potentials and ionic heats of formation for vinyl, allyl, and benzyl radicals,
Can. J. Chem., 1971, 49, 357. [all data]
Samson, Marmo, et al., 1962
Samson, J.A.R.; Marmo, F.F.; Watanabe, K.,
Absorption and photoionization coefficients of propylene and butene-1 in the vacuum ultraviolet,
J. Chem. Phys., 1962, 36, 3, 783-786. [all data]
Aflalaye, Sternberg, et al., 1995
Aflalaye, A.; Sternberg, R.; Raulin, F.; Vidal-Madjar, C.,
Gas chromatography of Titan's atmosphere. VI. Analysis of low-molecular-mass hydrocarbons and nitriles with BPX5 capillary columns,
J. Chromatogr. A, 1995, 708, 2, 283-291, https://doi.org/10.1016/0021-9673(95)00410-O
. [all data]
Do and Raulin, 1992
Do, L.; Raulin, F.,
Gas chromatography of Titan's atmosphere. III. Analysis of low-molecular-weight hydrocarbons and nitriles with a CP-Sil-5 CB WCOT capillary column,
J. Chromatogr., 1992, 591, 1-2, 297-301, https://doi.org/10.1016/0021-9673(92)80247-R
. [all data]
Do and Raulin, 1989
Do, L.; Raulin, F.,
Gas chromatography of Titan's atmosphere. I. Analysis of low-molecular-weight hydrocarbons and nitriles with a PoraPLOT Q porous polymer coated open-tubular capillary column,
J. Chromatogr., 1989, 481, 45-54, https://doi.org/10.1016/S0021-9673(01)96751-2
. [all data]
Anders, Anders, et al., 1985
Anders, G.; Anders, K.; Engewald, W.,
Identification of non-branched alkenylcycloalkanes with a terminal double bond from retention index increments,
Chromatographia, 1985, 20, 2, 83-86, https://doi.org/10.1007/BF02280602
. [all data]
Lubeck and Sutton, 1984
Lubeck, A.J.; Sutton, D.L.,
Kovats Retention Indices of Selected Olefins on Bonded Phase Fused Silica Capillaries,
J. Hi. Res. Chromatogr. Chromatogr. Comm., 1984, 7, 9, 542-544, https://doi.org/10.1002/jhrc.1240070913
. [all data]
Bredael, 1982
Bredael, P.,
Retention indices of hydrocarbons on SE-30,
J. Hi. Res. Chromatogr. Chromatogr. Comm., 1982, 5, 6, 325-328, https://doi.org/10.1002/jhrc.1240050610
. [all data]
Nijs and Jacobs, 1981
Nijs, H.H.; Jacobs, P.A.,
On-Line Single Run Analysis of Effluents from a Fischer-Tropsch Reactor,
J. Chromatogr. Sci., 1981, 19, 1, 40-45, https://doi.org/10.1093/chromsci/19.1.40
. [all data]
Schröder, 1980
Schröder, I.H.,
Retention Indices of Hydrocarbons up to C14 for the Stationary Phase Squalane,
J. Hi. Res. Chromatogr. Chromatogr. Comm., 1980, 3, 1, 38-44, https://doi.org/10.1002/jhrc.1240030115
. [all data]
Chrétien and Dubois, 1977
Chrétien, J.R.; Dubois, J.E.,
Topological analysis of gas-liquid chromatographic behavior of alkenes,
Anal. Chem., 1977, 49, 6, 747-756, https://doi.org/10.1021/ac50014a021
. [all data]
Lulova, Leont'eva, et al., 1976
Lulova, N.I.; Leont'eva, S.A.; Timofeeva, A.N.,
Gas-chromatographic method of determination of individual hydrocarbons in catalytic cracking gasolines
in Proceedings of All-Union Research Institute on Oil Processes. Vol.18, All-Union Research Institute on Oil Processes, Moscow, 1976, 30-53. [all data]
Matukuma, 1969
Matukuma, A.,
Retention indices of alkanes through C10 and alkenes through C8 and relation between boiling points and retention data,
Gas Chromatogr., Int. Symp. Anal. Instrum. Div Instrum Soc. Amer., 1969, 7, 55-75. [all data]
Hively and Hinton, 1968
Hively, R.A.; Hinton, R.E.,
Variation of the retention index with temperature on squalane substrates,
J. Gas Chromatogr., 1968, 6, 4, 203-217, https://doi.org/10.1093/chromsci/6.4.203
. [all data]
Widmer, 1967
Widmer, H.,
Gas chromatographic identification of hydrocarbons using retention indices,
J. Gas Chromatogr., 1967, 5, 10, 506-510, https://doi.org/10.1093/chromsci/5.10.506
. [all data]
Zulaïca and Guiochon, 1966
Zulaïca, J.; Guiochon, G.,
Analyse des hauts polymères par chromatographie en phase gazeuse de leurs produits de pyrolyse. II. Application à quelques hydrocarbures macromoléculaires purs,
Bull. Soc. Chim. Fr., 1966, 4, 1351-1363. [all data]
Haagen-Smit Laboratory, 1997
Haagen-Smit Laboratory,
Procedure for the detailed hydrocarbon analysis of gasolines by single column high efficiency (capillary) column gas chromatography, SOP NO. MLD 118, Revision No. 1.1, California Environmental Protection Agency, Air Resources Board, El Monte, California, 1997, 22. [all data]
Hoekman, 1993
Hoekman, S.K.,
Improved gas chromatography procedure for speciated hydrocarbon measurements of vehicle emissions,
J. Chromatogr., 1993, 639, 2, 239-253, https://doi.org/10.1016/0021-9673(93)80260-F
. [all data]
White, Hackett, et al., 1992
White, C.M.; Hackett, J.; Anderson, R.R.; Kail, S.; Spock, P.S.,
Linear temperature programmed retention indices of gasoline range hydrocarbons and chlorinated hydrocarbons on cross-linked polydimethylsiloxane,
J. Hi. Res. Chromatogr., 1992, 15, 2, 105-120, https://doi.org/10.1002/jhrc.1240150211
. [all data]
Voorhees, Hileman, et al., 1975
Voorhees, K.J.; Hileman, F.D.; Einhorn, I.N.,
Generation of retention index standards by pyrolysis of hydrocarbons,
Anal. Chem., 1975, 47, 14, 2385-2389, https://doi.org/10.1021/ac60364a035
. [all data]
Peng, Ding, et al., 1988
Peng, C.T.; Ding, S.F.; Hua, R.L.; Yang, Z.C.,
Prediction of Retention Indexes I. Structure-Retention Index Relationship on Apolar Columns,
J. Chromatogr., 1988, 436, 137-172, https://doi.org/10.1016/S0021-9673(00)94575-8
. [all data]
Li and Deng, 1998
Li, H.; Deng, C.,
Qualitative analysis of light components of gasoline cracking using Kovats retention indices,
J. Instrumental Analysis, 1998, 17, 1, 67-69. [all data]
Xieyun, Maoqi, et al., 1996
Xieyun, H.; Maoqi, C.; Shiyan, Y.,
Gas Chromatographic analysis during the process of heptaldehyde production using 1-hexene,
Chin. J. Chromatogr., 1996, 14, 4, 291-293. [all data]
Huguet, 1961
Huguet, M.,
Kovats retention indices in the qualitative analysis of light hydrocarbons by gas chromatography, Journees internationales d'etude des methodes de separation immediate et de chromatographie, 1961, 69. [all data]
Bramston-Cook, 2013
Bramston-Cook, R.,
Kovats indices for C2-C13 hydrocarbons and selected oxygenated/halocarbons with 100 % dimethylpolysiloxane columns, 2013, retrieved from http://lotusinstruments.com/monographs/List .... [all data]
Supelco, 2012
Supelco, CatalogNo. 24160-U,
Petrocol DH Columns. Catalog No. 24160-U, 2012, retrieved from http://www.sigmaaldrich.com/etc/medialib/docs/Supelco/Datasheet/1/w97949.Par.0001.File.tmp/w97949.pdf. [all data]
Tsuge, Ohtan, et al., 2011
Tsuge, S.; Ohtan, H.; Watanabe, C.,
Pyrolysis - GC/MS Data Book of Synthetic Polymers, Elsevier, 2011, 420. [all data]
Shoenmakers, Oomen, et al., 2000
Shoenmakers, P.J.; Oomen, J.L.M.M.; Blomberg, J.; Genuit, W.; van Velzen, G.,
Comparison of comprehensive two-dimensional gas chromatography and gas chromatography-mass spectrometry for the characterization of complex hydrocarbon mixtures,
J. Chromatogr. A, 2000, 892, 1-2, 29-46, https://doi.org/10.1016/S0021-9673(00)00744-5
. [all data]
Chupalov and Zenkevich, 1996
Chupalov, A.A.; Zenkevich, I.G.,
Chromatographic Characterization of Structural Transformations of Organic Compounds in Diels-Alder Reaction. Aliphatic Dienes and Dienophyls,
Zh. Org. Khim., 1996, 32, 6, 675-684. [all data]
Ciccioli, Cecinato, et al., 1992
Ciccioli, P.; Cecinato, A.; Brancaleoni, E.; Frattoni, M.; Liberti, A.,
Use of carbon adsorption traps combined with high resolution gas chromatography - mass spectrometry for the analysis of polar and non-polar C4-C14 hydrocarbons involved in photochemical smog formation,
J. Hi. Res. Chromatogr., 1992, 15, 2, 75-84, https://doi.org/10.1002/jhrc.1240150205
. [all data]
Blunden, Aneja, et al., 2005
Blunden, J.; Aneja, V.P.; Lonneman, W.A.,
Characterization of non-methane volatile organic compounds at swine facilities in eastern North Carolina,
Atm. Environ., 2005, 39, 36, 6707-6718, https://doi.org/10.1016/j.atmosenv.2005.03.053
. [all data]
Junkes, Castanho, et al., 2003
Junkes, B.S.; Castanho, R.D.M.; Amboni, C.; Yunes, R.A.; Heinzen, V.E.F.,
Semiempirical Topological Index: A Novel Molecular Descriptor for Quantitative Structure-Retention Relationship Studies,
Internet Electronic Journal of Molecular Design, 2003, 2, 1, 33-49. [all data]
Perkin Elmer Instruments, 2002
Perkin Elmer Instruments,
Detailed hydrocarbon analysis (DHAX) Model 4015, 2002, retrieved from http://www.perkinelmer.com/instruments. [all data]
Zenkevich, 2000
Zenkevich, I.G.,
Mutual Correlation between Gas Chromatographic Retention Indices of Unsaturated and Saturated Hydrocarbons found by Molecular Dynamics,
Z. Anal. Chem., 2000, 55, 10, 1091-1097. [all data]
Spieksma, 1999
Spieksma, W.,
Determination of vapor liquid equilibrium from the Kovats retention index on dimethylsilicone using the Wilson mixing tool,
J. Hi. Res. Chromatogr., 1999, 22, 10, 565-588, https://doi.org/10.1002/(SICI)1521-4168(19991001)22:10<565::AID-JHRC565>3.0.CO;2-2
. [all data]
Flanagan, Streete, et al., 1997
Flanagan, R.J.; Streete, P.J.; Ramsey, J.D.,
Volatile Substance Abuse, UNODC Technical Series, No 5, United Nations, Office on Drugs and Crime, Vienna International Centre, PO Box 500, A-1400 Vienna, Austria, 1997, 56, retrieved from http://www.odccp.org/pdf/technicalseries1997-01-011.pdf. [all data]
Zenkevich, 1997
Zenkevich, I.G.,
Influence of the Variations of Dynamics Molecular Parameterts on the Additivity of Chromatigraphic Retention Indices of Products of Organic Reactions Relative to Initial Reagents,
Dokl. Akad. Nauk (Rus.), 1997, 353, 5, 625-627. [all data]
Zenkevich, Chupalov, et al., 1996
Zenkevich, I.G.; Chupalov, A.A.; Herzschuh, R.,
Correlation of the Increments of Gas Chromatographic Retention Indices with the Differences of Innermolecular Energies of Reagents and Products of Chemical Reactions,
Zh. Org. Khim. (Rus.), 1996, 32, 11, 1685-1691. [all data]
Xu, Chu, et al., 1995
Xu, X.; Chu, S.; Song, N.,
Application of chromatographic studies of air pollution in China,
J. Chromatogr. A, 1995, 710, 1, 21-37, https://doi.org/10.1016/0021-9673(95)00173-K
. [all data]
Strete, Ruprah, et al., 1992
Strete, P.J.; Ruprah, M.; Ramsey, J.D.; Flanagan, R.J.,
Detection and identification of volatile substances by headspace capillary gas chromatography to aid the diagnosis of acute poisoning,
Analyst, 1992, 117, 7, 1111-1127, https://doi.org/10.1039/an9921701111
. [all data]
Ramsey and Flanagan, 1982
Ramsey, J.D.; Flanagan, R.J.,
Detection and Identification of Volatile Organic Compounds in Blood by Headspace Gas Chromatography as an Aid to the Diagnosis of Solvent Abuse,
J. Chromatogr., 1982, 240, 2, 423-444, https://doi.org/10.1016/S0021-9673(00)99622-5
. [all data]
Robinson and Odell, 1971
Robinson, P.G.; Odell, A.L.,
A system of standard retention indices and its uses. The characterisation of stationary phases and the prediction of retention indices,
J. Chromatogr., 1971, 57, 1-10, https://doi.org/10.1016/0021-9673(71)80001-8
. [all data]