3-Octanone
- Formula: C8H16O
- Molecular weight: 128.2120
- IUPAC Standard InChIKey: RHLVCLIPMVJYKS-UHFFFAOYSA-N
- CAS Registry Number: 106-68-3
- Chemical structure:
View 3d structure (requires JavaScript / HTML 5) - Other names: n-Octanone-3; Amyl ethyl ketone; Ethyl amyl ketone; Ethyl n-amyl ketone; Ethyl pentyl ketone; EAK; Octan-3-one; Ethyl n-pentyl ketone; 3-Oxooctane; NSC 60161; 3-octanonere

Gas phase thermochemistry data

Data compiled by: Hussein Y. Afeefy, Joel F. Liebman, and Stephen E. Stein
Quantity | Value | Units | Method | Reference | Comment |
---|---|---|---|---|---|
ΔfH°gas | -338.6 ± 3.3 | kJ/mol | Ccr | Geiseler and Ratzsch, 1965 |

Condensed phase thermochemistry data

Data compiled by: Hussein Y. Afeefy, Joel F. Liebman, and Stephen E. Stein
Quantity | Value | Units | Method | Reference | Comment |
---|---|---|---|---|---|
ΔcH°liquid | -5052.01 | kJ/mol | Ccr | Geiseler and Ratzsch, 1965 | Corresponding ΔfHºliquid = -382.7 kJ/mol (simple calculation by NIST; no Washburn corrections) |

Phase change data

Data compiled as indicated in comments:
BS - Robert L. Brown and Stephen E. Stein
TRC - Thermodynamics Research Center, NIST Boulder Laboratories, Chris Muzny director
ALS - Hussein Y. Afeefy, Joel F. Liebman, and Stephen E. Stein
AC - William E. Acree, Jr., James S. Chickos
Quantity | Value | Units | Method | Reference | Comment |
---|---|---|---|---|---|
Tboil | 439. ± 3. | K | AVG | N/A | Average of 6 values; Individual data points |
Quantity | Value | Units | Method | Reference | Comment |
Tc | 627.7 | K | N/A | Pulliam, Gude, et al., 1994 | Uncertainty assigned by TRC = 0.2 K; by the sealed ampule method; TRC |
Quantity | Value | Units | Method | Reference | Comment |
ρc | 2.01 | mol/l | N/A | Pulliam, Gude, et al., 1994 | Uncertainty assigned by TRC = 0.02 mol/l; TRC |
Quantity | Value | Units | Method | Reference | Comment |
ΔvapH° | 44.4 ± 0.2 | kJ/mol | V | Geiseler and Ratzsch, 1965 | ALS |
Enthalpy of vaporization
ΔvapH (kJ/mol) | Temperature (K) | Method | Reference | Comment |
---|---|---|---|---|
43.8 | 308. | A | Stephenson and Malanowski, 1987 | Based on data from 293. to 348. K.; AC |

Gas phase ion energetics data

Data compiled by: Henry M. Rosenstock, Keith Draxl, Bruce W. Steiner, and John T. Herron
Appearance energy determinations
Ion | AE (eV) | Other Products | Method | Reference | Comment |
---|---|---|---|---|---|
C3H5O+ | 12.0 ± 0.3 | C5H11 | EI | Yeo and Williams, 1969 | |
C4H8O+ | 10.5 ± 0.3 | ? | EI | Yeo and Williams, 1969 | |
C4H9O+ | 9.8 ± 0.3 | ? | EI | Yeo and Williams, 1969 | |
C5H9O+ | 10.9 ± 0.3 | ? | EI | Yeo and Williams, 1969 | |
C5H10O+ | 10.4 ± 0.3 | C3H6 | EI | Yeo and Williams, 1969 | |
C5H11+ | 11.5 ± 0.3 | ? | EI | Yeo and Williams, 1969 | |
C6H11O+ | 10.2 ± 0.3 | C2H5 | EI | Yeo and Williams, 1969 |

Kovats' RI, non-polar column, isothermal

Column type | Active phase | Temperature (C) | I | Reference | Comment |
---|---|---|---|---|---|
Capillary | OV-1 | 333. | 966. | Hu, Lu, et al., 2006 | |
Capillary | HP-1 | 110. | 967. | Héberger and Görgényi, 1999 | 50. m/0.32 mm/1.05 μm, N2 |
Capillary | HP-1 | 50. | 965. | Héberger and Görgényi, 1999 | 50. m/0.32 mm/1.05 μm, N2 |
Capillary | HP-1 | 70. | 965. | Héberger and Görgényi, 1999 | 50. m/0.32 mm/1.05 μm, N2 |
Capillary | HP-1 | 90. | 966. | Héberger and Görgényi, 1999 | 50. m/0.32 mm/1.05 μm, N2 |
Packed | Apiezon L | 130. | 948. | Wehrli and Kováts, 1959 | Celite; Column length: 2.25 m |
Packed | Apiezon L | 190. | 952. | Wehrli and Kováts, 1959 | Celite; Column length: 2.25 m |

Kovats' RI, non-polar column, temperature ramp

Column type | Active phase | I | Reference | Comment |
---|---|---|---|---|
Capillary | HP-5 | 985. | Tzakou and Couladis, 2001 | 30. m/0.25 mm/0.25 μm, He, 3. K/min; Tstart: 60. C; Tend: 280. C |
Capillary | DB-1 | 964. | Takeoka, Perrino, et al., 1996 | 60. m/0.25 mm/0.25 μm, 30. C @ 4. min, 2. K/min; Tend: 220. C |
Capillary | DB-1 | 969. | Takeoka, Perrino, et al., 1996 | 60. m/0.25 mm/0.25 μm, 30. C @ 4. min, 2. K/min; Tend: 220. C |
Capillary | OV-101 | 966. | Tamura, Kihara, et al., 1991 | N2, 2. K/min; Column length: 50. m; Column diameter: 0.25 mm; Tstart: 80. C; Tend: 200. C |
Capillary | OV-101 | 988. | Ohnishi and Shibamoto, 1984 | 2. K/min; Column length: 50. m; Column diameter: 0.23 mm; Tstart: 80. C; Tend: 200. C |
Capillary | OV-101 | 991. | Ohnishi and Shibamoto, 1984 | 2. K/min; Column length: 50. m; Column diameter: 0.23 mm; Tstart: 80. C; Tend: 200. C |

Kovats' RI, non-polar column, custom temperature program

Column type | Active phase | I | Reference | Comment |
---|---|---|---|---|
Capillary | AT-5 | 986. | Rojas and Usubillaga, 2000 | 60. m/0.25 mm/0.25 μm, He; Program: 60 C (1 min) 4 K/min -> 200 C 10 K/min -> 280 C |

Kovats' RI, polar column, isothermal

Column type | Active phase | Temperature (C) | I | Reference | Comment |
---|---|---|---|---|---|
Capillary | HP-Innowax | 110. | 1284.3 | Héberger and Görgényi, 1999 | 30. m/0.32 mm/0.5 μm |
Capillary | HP-Innowax | 50. | 1265.5 | Héberger and Görgényi, 1999 | 30. m/0.32 mm/0.5 μm |
Capillary | HP-Innowax | 70. | 1271.4 | Héberger and Görgényi, 1999 | 30. m/0.32 mm/0.5 μm |
Capillary | HP-Innowax | 90. | 1277.9 | Héberger and Görgényi, 1999 | 30. m/0.32 mm/0.5 μm |

Kovats' RI, polar column, temperature ramp

Column type | Active phase | I | Reference | Comment |
---|---|---|---|---|
Capillary | PE-Wax | 1241. | Chandravadana, Vekateshwarlu, et al., 2005 | N2, 60. C @ 4. min, 5. K/min, 200. C @ 5. min; Column length: 30. m; Column diameter: 0.25 mm |
Capillary | PE-Wax | 1241. | Venkateshwarlu, Chandravadana, et al., 1999 | N2, 60. C @ 4. min, 5. K/min, 200. C @ 5. min; Column length: 30. m; Column diameter: 0.25 mm |
Capillary | Carbowax 20M | 1264. | Tamura, Kihara, et al., 1991 | 2. K/min; Column length: 50. m; Column diameter: 0.25 mm; Tstart: 80. C; Tend: 180. C |
Packed | Carbowax 20M | 1224. | Chen, Chen, et al., 1984 | N2, Chromosorb W A/W DMCS, 3. K/min; Column length: 2. m; Tstart: 60. C; Tend: 200. C |
Capillary | Carbowax 20M | 1240. | Buttery, Kamm, et al., 1982 | He, 50. C @ 30. min, 1. K/min; Column length: 150. m; Column diameter: 0.64 mm; Tend: 170. C |
Capillary | Carbowax 20M | 1240. | Buttery, Kamm, et al., 1982 | He, 50. C @ 30. min, 1. K/min; Column length: 150. m; Column diameter: 0.64 mm; Tend: 170. C |

Van Den Dool and Kratz RI, non-polar column, temperature ramp

Column type | Active phase | I | Reference | Comment |
---|---|---|---|---|
Capillary | RTX-1 | 963. | Bendahou, Muselli, et al., 2008 | 60. m/0.22 mm/0.25 μm, He, 2. K/min, 230. C @ 30. min; Tstart: 60. C |
Capillary | DB-5MS | 988. | Cho, Namgung, et al., 2008 | 30. m/0.25 mm/0.25 μm, He, 40. C @ 1. min, 4. K/min, 200. C @ 10. min |
Capillary | DB-5MS | 988. | Cho, Namgung, et al., 2008 | 30. m/0.25 mm/0.25 μm, He, 40. C @ 1. min, 4. K/min, 200. C @ 10. min |
Capillary | DB-5MS | 971. | Cho I.H., Lee S.M., et al., 2007 | 30. m/0.25 mm/0.25 μm, He, 40. C @ 1. min, 4. K/min, 200. C @ 10. min |
Capillary | HP-5MS | 984. | Vagionas, Ngassapa, et al., 2007 | 30. m/0.25 mm/0.25 μm, He, 3. K/min; Tstart: 60. C; Tend: 280. C |
Capillary | DB-5MS | 971. | Cho, Kim, et al., 2006 | 30. m/0.25 mm/0.25 μm, He, 40. C @ 1. min, 4. K/min, 200. C @ 10. min |
Capillary | SPB-1 | 962. | Pinto, Pina-Vaz, et al., 2006 | 30. m/0.2 mm/0.2 μm, He, 3. K/min, 220. C @ 15. min; Tstart: 70. C |
Capillary | HP-5MS | 988.7 | Zhao C.X., Li, et al., 2006 | 30. m/0.25 mm/0.25 μm, He, 4. K/min; Tstart: 80. C; Tend: 300. C |
Capillary | CP Sil 5 CB | 969. | Ziegenbein, Hanssen, et al., 2006 | H2, 10. K/min; Column length: 25. m; Column diameter: 0.25 mm; Tstart: 80. C; Tend: 270. C |
Capillary | CP Sil 5 CB | 969. | Ziegenbein, Hanssen, et al., 2006, 2 | 25. m/0.25 mm/0.4 μm, He, 10. K/min; Tstart: 80. C; Tend: 270. C |
Capillary | SE-54 | 982. | Brantner, Pfeifhofer, et al., 2005 | 50. m/0.25 mm/0.27 μm, H2, 5. K/min; Tstart: 50. C; Tend: 300. C |
Capillary | HP-5 | 989. | Flamini, Luigi Cioni, et al., 2005 | 30. m/0.25 mm/0.25 μm, N2, 60. C @ 10. min, 5. K/min; Tend: 220. C |
Capillary | HP-5 | 982. | Javidnia, Miri, et al., 2005 | He, 3. K/min; Column length: 30. m; Column diameter: 0.25 mm; Tstart: 60. C; Tend: 260. C |
Capillary | DB-5 | 970. | Wu, Zorn, et al., 2005 | 30. m/0.32 mm/0.25 μm, He, 40. C @ 2. min, 5. K/min, 250. C @ 5. min |
Capillary | HP-5 | 989. | Bertoli, Pistelli, et al., 2004 | 30. m/0.25 mm/0.25 μm, N2, 60. C @ 10. min, 5. K/min; Tend: 220. C |
Capillary | BPX-5 | 998. | Dickschat, Wenzel, et al., 2004 | 25. m/0.22 mm/0.25 μm, He, 50. C @ 5. min, 5. K/min; Tend: 300. C |
Capillary | HP-5 | 989. | Flamini, Luigi Cioni, et al., 2004 | 30. m/0.25 mm/0.25 μm, N2, 60. C @ 10. min, 5. K/min; Tend: 220. C |
Capillary | HP-5 | 986. | Javidnia, Miri, et al., 2004 | He, 3. K/min; Column length: 30. m; Column diameter: 0.25 mm; Tstart: 60. C; Tend: 260. C |
Capillary | DB-5 | 988. | Javidnia, Miri, et al., 2004, 2 | 30. m/0.25 mm/0.25 μm, He, 3. K/min; Tstart: 60. C; Tend: 260. C |
Capillary | SPB-5 | 986. | Pino, Marbot, et al., 2004 | 30. m/0.25 mm/0.25 μm, He, 60. C @ 2. min, 4. K/min, 250. C @ 20. min |
Capillary | DB-5 | 988. | Bader, Caponi, et al., 2003 | 30. m/0.25 mm/0.25 μm, He, 3. K/min, 240. C @ 30. min; Tstart: 60. C |
Capillary | HP-5MS | 985. | Salido, Altarejos, et al., 2003 | 30. m/0.25 mm/0.25 μm, He, 3. K/min; Tstart: 50. C; Tend: 250. C |
Capillary | DB-5 | 986. | Javidnia, Miri, et al., 2002 | He, 4. K/min; Column length: 25. m; Column diameter: 0.25 mm; Tstart: 70. C; Tend: 275. C |
Capillary | DB-5 | 986. | Miri, Ramezani, et al., 2002 | He, 4. K/min; Column length: 25. m; Column diameter: 0.25 mm; Tstart: 70. C; Tend: 260. C |
Capillary | RTX-5 | 986. | Shellie, Mondello, et al., 2002 | 30. m/0.25 mm/0.25 μm, He, 45. C @ 6. min, 3. K/min; Tend: 250. C |
Capillary | RTX-5 | 994. | Shellie, Mondello, et al., 2002 | 30. m/0.25 mm/0.25 μm, He, 45. C @ 6. min, 3. K/min; Tend: 250. C |
Capillary | HP-5 | 988. | Aligiannis, Kalpoutzakis, et al., 2001 | 30. m/0.25 mm/0.25 μm, He, 60. C @ 5. min, 3. K/min; Tend: 280. C |
Capillary | HP-5MS | 986. | Skaltsa, Mavrommati, et al., 2001 | 30. m/0.25 mm/0.25 μm, He, 60. C @ 5. min, 4. K/min; Tend: 280. C |
Capillary | DB-1 | 967. | Specht and Baltes, 1994 | 60. m/0.25 mm/0.25 μm, 35. C @ 10. min, 2. K/min, 280. C @ 10. min |
Capillary | CP Sil 5 CB | 970. | Hendriks and Bruins, 1983 | 4. K/min; Column length: 25. m; Column diameter: 0.22 mm; Tstart: 70. C; Tend: 205. C |

Van Den Dool and Kratz RI, non-polar column, custom temperature program

Column type | Active phase | I | Reference | Comment |
---|---|---|---|---|
Capillary | SE-52 | 985. | Bruni, Bianchi, et al., 2007 | 30. m/0.32 mm/0.15 μm, He; Program: 45C => 1C/min => 100C => 5C/min => 250C(10min) |
Capillary | 5 % Phenyl methyl siloxane | 984. | Sacchetti, Maietti, et al., 2005 | 30. m/0.32 mm/0.15 μm, He; Program: 45C => 1C/min => 100C => 5C/min => 250C (10min) |
Capillary | HP-5 | 975. | Boué, Shih, et al., 2003 | 50. m/0.2 mm/0.5 μm, He; Program: 40C(3min) => 10C/min => 60C =3C/min => 150C => 20C/min => 250C (5min) |
Capillary | SE-52 | 978. | Lorenzo, Paz, et al., 2002 | 30. m/0.32 mm/0.42 μm, H2; Program: 60C(8min) => 3C/min => 180C => 20C/min => 250C(10min) |
Capillary | SE-54 | 985. | Kubícková and Grosch, 1997 | Column length: 30. m; Column diameter: 0.32 mm; Program: 35C (2min) => 40C/min => 50C (2min) => 4C/min => 250C (10min) |
Capillary | BPX-5 | 994. | Owens J.D., Allagheny N., et al., 1997 | 50. m/0.32 mm/0.5 μm, He; Program: OC => 60C/min => 60C(5min) => 4C/min => 250C(20min) |

Van Den Dool and Kratz RI, polar column, temperature ramp

Column type | Active phase | I | Reference | Comment |
---|---|---|---|---|
Capillary | RTX-Wax | 1253. | Bendahou, Muselli, et al., 2008 | 60. m/0.22 mm/0.25 μm, He, 2. K/min, 230. C @ 30. min; Tstart: 60. C |
Capillary | DB-Wax | 1261. | Cho, Namgung, et al., 2008 | 30. m/0.25 mm/0.25 μm, He, 40. C @ 1. min, 4. K/min, 200. C @ 10. min |
Capillary | DB-Wax | 1240. | Cho, Namgung, et al., 2008 | 30. m/0.25 mm/0.25 μm, He, 40. C @ 1. min, 4. K/min, 200. C @ 10. min |
Capillary | DB-Wax | 1240. | Cho I.H., Lee S.M., et al., 2007 | 60. m/0.25 mm/0.25 μm, He, 40. C @ 1. min, 4. K/min, 200. C @ 10. min |
Capillary | DB-Wax | 1259. | Cho, Choi, et al., 2006 | 60. m/0.25 mm/0.25 μm, He, 40. C @ 1. min, 4. K/min, 200. C @ 10. min |
Capillary | DB-Wax | 1261. | Cho, Choi, et al., 2006 | 60. m/0.25 mm/0.25 μm, He, 40. C @ 1. min, 4. K/min, 200. C @ 10. min |
Capillary | DB-Wax | 1240. | Cho, Kim, et al., 2006 | 60. m/0.25 mm/0.25 μm, He, 40. C @ 1. min, 4. K/min, 200. C @ 10. min |
Capillary | DB-Wax | 1250. | Fernandez-Segovia, Escriche, et al., 2006 | 30. m/0.25 mm/0.25 μm, He, 50. C @ 5. min, 10. K/min, 230. C @ 25. min |
Capillary | ZB-Wax | 1210. | Ledauphin, Basset, et al., 2006 | 30. m/0.25 mm/0.15 μm, He, 35. C @ 5. min, 5. K/min, 220. C @ 10. min |
Capillary | Stabilwax | 1244. | Cros, Lignot, et al., 2005 | 60. m/0.25 mm/0.25 μm, He, 40. C @ 5. min, 3. K/min, 240. C @ 10. min |
Capillary | Supelcowax-10 | 1266. | Riu-Aumatell, Lopez-Tamames, et al., 2005 | 30. m/0.25 mm/0.25 μm, He, 60. C @ 5. min, 3. K/min, 240. C @ 10. min |
Capillary | ZB-Wax | 1244. | Wu, Zorn, et al., 2005 | 30. m/0.32 mm/0.25 μm, He, 40. C @ 2. min, 5. K/min, 250. C @ 5. min |
Capillary | HP-Wax | 1242. | Flamini, Luigi Cioni, et al., 2004 | 30. m/0.25 mm/0.25 μm, N2, 60. C @ 10. min, 5. K/min; Tend: 220. C |
Capillary | ZB-Wax | 1239. | Ledauphin, Saint-Clair, et al., 2004 | 30. m/0.25 mm/0.15 μm, He, 35. C @ 5. min, 5. K/min, 220. C @ 10. min |
Capillary | DB-Wax | 1272. | Nielsen, Larsen, et al., 2004 | 30. m/0.25 mm/0.25 μm, He, 45. C @ 10. min, 6. K/min, 240. C @ 30. min |
Capillary | DB-Wax | 1272. | Nielsen, Larsen, et al., 2004, 2 | 30. m/0.25 mm/0.25 μm, He, 45. C @ 10. min, 6. K/min, 240. C @ 30. min |
Capillary | HP-Wax | 1242. | Bader, Caponi, et al., 2003 | 30. m/0.25 mm/0.25 μm, N2, 60. C @ 10. min, 5. K/min; Tend: 220. C |
Capillary | Stabilwax | 1244. | Cros, Vandanjon, et al., 2003 | 60. m/0.25 mm/0.25 μm, He, 40. C @ 5. min, 3. K/min, 240. C @ 10. min |
Capillary | DB-Wax | 1272. | Nielsen, Larsen, et al., 2003 | 30. m/0.25 mm/0.25 μm, He, 40. C @ 10. min, 6. K/min, 240. C @ 30. min |
Capillary | Supelcowax-10 | 1258. | Chung, Yung, et al., 2002 | 60. m/0.25 mm/0.25 μm, He, 35. C @ 5. min, 2. K/min, 195. C @ 90. min |
Capillary | RTX-Wax | 1205. | Shellie, Mondello, et al., 2002 | 30. m/0.25 mm/0.25 μm, He, 45. C @ 6. min, 3. K/min; Tend: 250. C |
Capillary | RTX-Wax | 1242. | Shellie, Mondello, et al., 2002 | 30. m/0.25 mm/0.25 μm, He, 45. C @ 6. min, 3. K/min; Tend: 250. C |
Capillary | Supelcowax-10 | 1258. | Chung, Yung, et al., 2001 | 60. m/0.25 mm/0.25 μm, He, 35. C @ 5. min, 2. K/min, 195. C @ 90. min |
Capillary | DB-Wax | 1278. | Beauchene, Grua-Priol, et al., 2000 | 60. m/0.32 mm/0.5 μm, He, 3. K/min, 160. C @ 5. min; Tstart: 30. C |
Capillary | Supelcowax-10 | 1258. | Chung, 2000 | 60. m/0.25 mm/0.25 μm, He, 2. K/min, 195. C @ 90. min; Tstart: 35. C |
Capillary | Supelcowax-10 | 1258. | Chung, 1999 | 60. m/0.25 mm/0.25 μm, He, 35. C @ 5. min, 2. K/min, 195. C @ 90. min |
Capillary | DB-Wax | 1270. | Mau, Lin, et al., 1998 | 60. m/0.32 mm/0.25 μm, 2. K/min; Tstart: 40. C; Tend: 200. C |
Capillary | DB-Wax | 1270. | Mau and Hwang, 1997 | 30. m/0.53 mm/0.25 μm, N2, 2. K/min; Tstart: 50. C; Tend: 200. C |
Capillary | FFAP | 1300. | Ott, Fay, et al., 1997 | 30. m/0.25 mm/0.25 μm, He, 20. C @ 1. min, 4. K/min, 200. C @ 1. min |
Capillary | CP-Wax 52CB | 1225. | Wu and Liou, 1992 | H2, 50. C @ 10. min, 1.5 K/min, 200. C @ 80. min; Column length: 50. m; Column diameter: 0.32 mm |
Capillary | Supelcowax-10 | 1259. | Tanchotikul and Hsieh, 1989 | 60. m/0.25 mm/0.25 μm, 40. C @ 5. min, 2. K/min, 175. C @ 20. min |
Capillary | Supelcowax-10 | 1264. | Tanchotikul and Hsieh, 1989 | 60. m/0.25 mm/0.25 μm, 40. C @ 5. min, 2. K/min, 175. C @ 20. min |
Capillary | CP-WAX 57CB | 1244. | Salter L.J., Mottram D.S., et al., 1988 | 60. C @ 5. min, 4. K/min; Column length: 50. m; Column diameter: 0.32 mm; Tend: 200. C |

Van Den Dool and Kratz RI, polar column, custom temperature program

Column type | Active phase | I | Reference | Comment |
---|---|---|---|---|
Capillary | Supelcowax-10 | 1255. | Bianchi, Cantoni, et al., 2007 | 30. m/0.25 mm/0.25 μm; Program: 35C(8min) => 4C/min => 60C => 6C/min => 160C => 20C/min => 220C(1min) |
Capillary | Supelcowax-10 | 1251. | Bianchi, Careri, et al., 2007 | 30. m/0.25 mm/0.25 μm, He; Program: 35C(8min) => 4C/min => 60C => 6C/min => 160C => 20C/min => 200C(1min) |
Capillary | DB-Wax | 1256. | Pennarun, Prost, et al., 2003 | 30. m/0.32 mm/0.5 μm, He; Program: 50C => 6C/min => 70C => 4C/min => 150C => 10C/min => 250C |
Capillary | DB-Wax | 1256. | Pennarun, Prost, et al., 2002 | 30. m/0.32 mm/0.5 μm, He; Program: 50C => 6C/min => 70C => 4C/min => 150C => 10C/min => 250C |
Capillary | DB-Wax | 1245. | Cantergiani, Brevard, et al., 2001 | 30. m/0.25 mm/0.25 μm; Program: 20C(30s) => fast => 60C => 4C/min => 220C (20min) |
Capillary | DB-Wax | 1284.7 | Yang, Chyau, et al., 1998 | He; Column length: 50. m; Column diameter: 0.32 mm; Program: 50C => 2.5C/min => 150C => 1.5C/min => 210C |
Capillary | DB-Wax | 1281.9 | Yang, Chyau, et al., 1998 | He; Column length: 50. m; Column diameter: 0.32 mm; Program: 50C => 2.5C/min => 150C => 1.5C/min => 210C |

Normal alkane RI, non-polar column, isothermal

Column type | Active phase | Temperature (C) | I | Reference | Comment |
---|---|---|---|---|---|
Capillary | OV-1 | 60. | 965. | Amboni, Junkes, et al., 2002 |

Normal alkane RI, non-polar column, temperature ramp

Column type | Active phase | I | Reference | Comment |
---|---|---|---|---|
Capillary | Optima-5 MS | 983. | Goeminne, Vandendriessche, et al., 2012 | 30. m/0.25 mm/0.25 μm, Helium, 35. C @ 3. min, 10. K/min, 250. C @ 5. min |
Capillary | DB-1 | 988. | Fathi, Sahari, et al., 2011 | 30. m/0.25 mm/0.25 μm, Helium, 5. K/min; Tstart: 40. C; Tend: 210. C |
Capillary | VF-5 MS | 989. | Leffingwell and Alford, 2011 | 60. m/0.32 mm/0.25 μm, Helium, 2. K/min, 260. C @ 28. min; Tstart: 30. C |
Capillary | VF-5 MS | 990. | Leffingwell and Alford, 2011 | 60. m/0.32 mm/0.25 μm, Helium, 2. K/min, 260. C @ 28. min; Tstart: 30. C |
Capillary | HP-5 MS | 988. | Miyazawa, Marumoto, et al., 2011 | 30. m/0.25 mm/0.25 μm, Helium, 4. K/min, 260. C @ 5. min; Tstart: 40. C |
Capillary | HP-5 MS | 982. | Radulovic, Dordevic, et al., 2010 | 30. m/0.25 mm/0.25 μm, Helium, 5. K/min, 290. C @ 10. min; Tstart: 70. C |
Capillary | DB-1 | 964. | Xu, Tang, et al., 2010 | 30. m/0.25 mm/0.25 μm, Helium, 50. C @ 2. min, 4. K/min, 220. C @ 2. min |
Capillary | HP-5 MS | 987. | Farhat, Ginies, et al., 2009 | 30. m/0.25 mm/0.25 μm, Helium, 60. C @ 8. min, 2. K/min, 250. C @ 15. min |
Capillary | DB-5 | 992. | Porto, Decorti, et al., 2009 | 30. m/0.25 mm/0.25 μm, Helium, 45. C @ 3. min, 3. K/min, 250. C @ 5. min |
Capillary | HP-5 MS | 983. | Sahraoui, Vian, et al., 2008 | 30. m/0.25 mm/0.25 μm, Helium, 60. C @ 8. min, 2. K/min, 250. C @ 15. min |
Capillary | HP-5 MS | 990. | Thakeow, Angeli, et al., 2008 | 30. m/0.25 mm/0.25 μm, Helium, 50. C @ 1.5 min, 6.5 K/min, 250. C @ 10. min |
Capillary | RTX-5 | 986. | Berdague, Tournayre, et al., 2007 | 60. m/0.32 mm/1. μm, 40. C @ 5. min, 4. K/min, 205. C @ 5. min |
Capillary | DB-1 | 963. | Salehi, Fakhari, et al., 2007 | 60. m/0.25 mm/0.25 μm, He, 5. K/min; Tstart: 60. C; Tend: 250. C |
Capillary | RTX-5 | 989. | Setkova, Risticevic, et al., 2007 | 10. m/0.18 mm/0.2 μm, He, 40. C @ 0.5 min, 50. K/min, 275. C @ 0.5 min |
Capillary | HP-5 MS | 984. | Vagionas, Graikou, et al., 2007 | 30. m/0.25 mm/0.25 μm, Helium, 3. K/min; Tstart: 60. C; Tend: 280. C |
Capillary | SPB-5 | 987. | Vasta, Ratel, et al., 2007 | 60. m/0.32 mm/1. μm, 40. C @ 5. min, 3. K/min, 230. C @ 5. min |
Capillary | HP-5 | 987. | Figuérédo, Cabassu, et al., 2006 | 30. m/0.25 mm/0.25 μm, He, 50. C @ 5. min, 5. K/min, 300. C @ 5. min |
Capillary | HP-5 | 990. | Jiménez, Aguilera, et al., 2006 | 30. m/0.25 mm/0.25 μm, 40. C @ 5. min, 4. K/min, 220. C @ 10. min |
Capillary | ZB-5 | 985. | Sari M., Biondi D.M., et al., 2006 | 30. m/0.25 mm/0.25 μm, He, 2. K/min; Tstart: 40. C; Tend: 300. C |
Capillary | BPX5 | 979. | Boustie, Rapior, et al., 2005 | 25. m/0.20 mm/0.13 μm, He, 50. C @ 2. min, 3. K/min; Tend: 230. C |
Capillary | DB-5 | 990. | Chagonda and Chalchat, 2005 | 50. m/0.3 mm/0.25 μm, 2. K/min; Tstart: 60. C; Tend: 240. C |
Capillary | DB-1 | 966. | Fakhari, Salehi, et al., 2005 | 60. m/0.25 mm/0.25 μm, He, 5. K/min; Tstart: 60. C; Tend: 250. C |
Capillary | DB-5 | 977. | Jelén, Krawczyk, et al., 2005 | 30. m/0.25 mm/0.25 μm, He, 8. K/min; Tstart: 40. C; Tend: 280. C |
Capillary | DB-5 | 984. | Morteza-Semnani, Akbarzadeh, et al., 2005 | 30. m/0.25 mm/0.25 μm, He, 60. C @ 5. min, 4. K/min; Tend: 220. C |
Capillary | HP-5MS | 983. | Sajjadi, 2005 | 30. m/0.25 mm/0.25 μm, He, 4. K/min; Tstart: 60. C; Tend: 280. C |
Capillary | PE-5 | 988. | Singh, Raina, et al., 2005 | 30. m/0.32 mm/0.25 μm, H2, 60. C @ 2. min, 5. K/min, 230. C @ 4. min |
Capillary | DB-5 | 984. | Skoula and Grayer, 2005 | 30. m/0.25 mm/0.25 μm, He, 3. K/min, 230. C @ 20. min; Tstart: 60. C |
Capillary | HP-5MS | 976. | Tepe B., Sokmen M., et al., 2005 | 30. m/0.25 mm/0.25 μm, He, 50. C @ 3. min, 3. K/min; Tend: 240. C |
Capillary | HP-5 | 970. | N/A | 30. m/0.32 mm/0.25 μm, Helium, 40. C @ 2. min, 5. K/min, 250. C @ 5. min |
Capillary | DB-5 | 983. | Kalvandi, Sefidkon, et al., 2004 | 60. m/0.25 mm/0.25 μm, He, 40. C @ 4. min, 4. K/min; Tend: 280. C |
Capillary | HP-5 | 984. | Ghannadi and Zolfaghari, 2003 | 30. m/0.25 mm/0.25 μm, He, 4. K/min; Tstart: 60. C; Tend: 275. C |
Capillary | HP-5 | 966. | Pitarokili, Tzakou, et al., 2003 | 30. m/0.25 mm/0.25 μm, He, 3. K/min; Tstart: 60. C; Tend: 280. C |
Capillary | HP-5 | 980. | Velickovic, Randjelovic, et al., 2003 | 25. m/0.32 mm/0.53 μm, H2, 4. K/min; Tstart: 40. C; Tend: 280. C |
Capillary | HP-5 | 984. | Velickovic, Randjelovic, et al., 2003 | 25. m/0.32 mm/0.53 μm, H2, 4. K/min; Tstart: 40. C; Tend: 280. C |
Capillary | RSL-200 | 965. | Jirovetz, Smith, et al., 2002 | 30. m/0.25 mm/0.25 μm, H2, 40. C @ 2. min, 6. K/min, 280. C @ 10. min |
Capillary | DB-5 | 987. | Kobaisy, Tellez, et al., 2002 | 30. m/0.25 mm/0.25 μm, He, 3. K/min; Tstart: 60. C; Tend: 240. C |
Capillary | SPB-5 | 986. | Cornu, Carnat, et al., 2001 | He, 40. C @ 5. min, 3. K/min, 220. C @ 15. min; Column length: 60. m; Column diameter: 0.32 mm |
Capillary | DB-5 | 984. | Maia, Zoghbi, et al., 2000 | 30. m/0.25 mm/0.25 μm, He, 3. K/min; Tstart: 60. C; Tend: 240. C |
Capillary | BP-1 | 987. | Mohagheghzadeh, Shams-Ardakani, et al., 2000 | 25. m/0.33 mm/1.0 μm, N2, 4. K/min; Tstart: 60. C; Tend: 275. C |
Capillary | HP-5 | 986. | Mohagheghzadeh, Shams-Ardakani, et al., 2000, 2 | 30. m/0.25 mm/0.25 μm, He, 4. K/min; Tstart: 60. C; Tend: 275. C |
Capillary | DB-5 | 987. | Tellez, Dayan, et al., 2000 | 30. m/0.25 mm/0.25 μm, He, 3. K/min; Tstart: 60. C; Tend: 240. C |
Capillary | DB-1 | 970. | Shafiee, Javidnia, et al., 1999 | He, 3. K/min, 230. C @ 5. min; Column length: 60. m; Column diameter: 0.32 mm; Tstart: 60. C |
Capillary | DB-1 | 965. | Rapior, Breheret, et al., 1997 | 30. m/0.2 mm/0.25 μm, He, 50. C @ 2. min, 4. K/min; Tend: 200. C |
Capillary | HP-5 | 988. | Larsen and Frisvad, 1995 | 35. C @ 2. min, 6. K/min; Tend: 200. C |
Capillary | HP-5 | 988. | Larsen and Frisvad, 1995, 2 | 35. C @ 2. min, 6. K/min; Tend: 200. C |
Capillary | Cross-Linked Methylsilicone | 962. | Bravo and Hotchkiss, 1993 | He, 35. C @ 3. min, 4. K/min; Column length: 25. m; Column diameter: 0.32 mm; Tend: 225. C |
Capillary | DB-5 | 990. | Macku and Shibamoto, 1991 | He, 40. C @ 5. min, 2. K/min; Column length: 60. m; Column diameter: 0.25 mm; Tend: 160. C |
Capillary | OV-101 | 966. | Tamura, Kihara, et al., 1990 | Nitrogen, 2. K/min; Column length: 50. m; Column diameter: 0.25 mm; Tstart: 80. C; Tend: 200. C |
Capillary | DB-1 | 964. | Binder and Flath, 1989 | 50. C @ 0.1 min, 4. K/min, 250. C @ 5. min; Column length: 60. m; Column diameter: 0.32 mm |
Capillary | OV-1 | 973. | de Pooter, Nicolai, et al., 1988 | 50. m/0.20 mm/0.20 μm, He, 2. K/min; Tstart: 30. C; Tend: 220. C |
Capillary | OV-101 | 964. | del Rosario, de Lumen, et al., 1984 | He, 0. C @ 1. min, 3. K/min; Column length: 50. m; Column diameter: 0.31 mm; Tend: 225. C |

Normal alkane RI, non-polar column, custom temperature program

Column type | Active phase | I | Reference | Comment |
---|---|---|---|---|
Capillary | HP-5 | 987. | Fang, Pu, et al., 2012 | 30. m/0.25 mm/0.25 μm, Helium; Program: 30 0C (1 min) 2 0C/min -> 100 0C (5 min) 5 0C/min -> 170 0C |
Capillary | Polydimethyl siloxane with 5 % Ph groups | 989. | Robinson, Adams, et al., 2012 | Program: not specified |
Capillary | Polydimethyl siloxane with 5 % Ph groups | 989. | Robinson, Adams, et al., 2012 | Program: not specified |
Capillary | HP-5 | 987. | Citron, Riclea, et al., 2011 | Program: not specified |
Capillary | DB-1 | 988. | Xu, Tang, et al., 2010 | 30. m/0.25 mm/0.25 μm, Helium; Program: not specified |
Capillary | DB-5 | 989. | Courtois, Paine, et al., 2009 | 30. m/0.25 mm/0.25 μm, Helium; Program: 50 0C m6 0C/min -> 140 0C 5 0C/min -> 160 0C (1 min) 10 0C/min -> 200 0C |
Capillary | HP-5 | 992. | Maggi, Bilek, et al., 2009 | 25. m/0.32 mm/0.17 μm, Helium; Program: 60 0C (5 min) 4 0C/min -> 220 0C 11 0C/min -> 280 0C |
Capillary | DB-5 | 994. | Porto, Decorti, et al., 2009 | 30. m/0.25 mm/0.25 μm, Helium; Program: not specified |
Capillary | DB-5 | 999. | Porto, Decorti, et al., 2009 | 30. m/0.25 mm/0.25 μm, Helium; Program: not specified |
Capillary | HP-1 | 959. | Barra, Baldovini, et al., 2007 | 50. m/0.2 mm/0.33 μm, He; Program: 40C(2min) => 2C/min => 200C => 15C/min => 250C (30min) |
Capillary | Methyl Silicone | 948. | Chen and Feng, 2007 | Program: not specified |
Capillary | Methyl Silicone | 966. | Feng and Mu, 2007 | Program: not specified |
Capillary | HP-1 | 984. | Merle, Verdeguer, et al., 2007 | 30. m/0.2 mm/0.33 μm, He; Program: 60C(5min) => 3C/min => 180C => 20C/min => 280C(10min) |
Capillary | CP Sil 8 CB | 984. | Mockute, Bernotiene, et al., 2007 | 50. m/0.32 mm/0.25 μm, He; Program: 60 0C (2 min) 5 0C/min -> 160 0C 5 0C/min -> 250 0C (10 min) |
Capillary | HP-5 | 979. | Splivallo, Bossi, et al., 2007 | He; Program: 50C => 3C/min => 200C(10min) => 10C/min => 290C(10min) |
Capillary | SPB-5 | 977. | Chemat, Lucchesi, et al., 2006 | 60. m/0.32 mm/1. μm, He; Program: 60C => 1C/min => 130C => 2C/min => 200C => 4C/min => 250C (40min) |
Capillary | SPB-5 | 977. | Iriti, Colnaghi, et al., 2006 | 60. m/0.32 mm/1. μm, He; Program: 60C => 1C/min => 130C => 2C/min => 200C => 4C/min => 250C(40min) |
Capillary | SE-52 | 984. | Tognolini, Barocelli, et al., 2006 | 30. m/0.32 mm/0.15 μm, He; Program: 45C => 1C/min => 100C => 5C/min => 250C (10min) |
Capillary | DB-1 | 963. | Belhattab, Larous, et al., 2005 | 30. m/0.25 mm/0.25 μm, He; Program: 45C => 3C/min => 175C => 15C/min => 300C(10min) |
Capillary | DB-1 | 961. | Figueiredo, Sim-Sim, et al., 2005 | 30. m/0.25 mm/0.25 μm, He; Program: 45C => 3C/min => 175C => 15C/min => 300C (10min) |
Capillary | MDN-5 | 977. | Jelen and Grabarkiewicz-Szczesna, 2005 | 30. m/0.25 mm/0.25 μm; Program: not specified |
Capillary | Polydimethyl siloxane with 5 % Ph groups | 986. | Pino, Marbot, et al., 2005 | Program: not specified |
Capillary | HP-5 | 988. | Garcia-Estaban, Ansorena, et al., 2004 | 50. m/0.32 mm/1.05 μm; Program: 40C(10min) => 5C/min => 200C => 20C/min => 250C(5min) |
Capillary | DB-5 | 988. | Garcia-Estaban, Ansorena, et al., 2004, 2 | 50. m/0.32 mm/1.05 μm; Program: 40C(10min) => 5C/min => 200C => 20C/min => 250C (5min) |
Capillary | HP-1 | 965. | Junkes, Amboni, et al., 2004 | Program: not specified |
Capillary | HP-5MS | 984. | Sahin, Gulluce, et al., 2004 | 30. m/0.25 mm/0.25 μm, He; Program: 50C(3min) => 3C/min => 150C(10min) => 10C/min => 250C |
Capillary | SE-30 | 970. | Vinogradov, 2004 | Program: not specified |
Capillary | SPB-5 | 986. | Begnaud, Pérès, et al., 2003 | 60. m/0.32 mm/1. μm; Program: not specified |
Capillary | Polydimethyl siloxane | 965. | Junkes, Castanho, et al., 2003 | Program: not specified |
Capillary | AT-5 | 986. | Usai, Atzei, et al., 2003 | 60. m/0.25 mm/0.25 μm, He; Program: 50 0C 5 0C/min -> 135 0C (1 min) 5 0C/min -> 225 0C (5 min) 5 0C/min -> 260 0C |
Capillary | HP-1 | 994. | Nogueira and Romano, 2002 | 30. m/0.32 mm/0.25 μm, He; Program: 40C(3min) => 5C/min => 180C => 15C/min => 240C(15min) |
Capillary | DB-5 | 980. | Rapior, Breheret, et al., 2002 | 30. m/0.20 mm/1.0 μm; Program: not specified |
Capillary | DB-5 | 980. | Rapior, Breheret, et al., 2002 | 30. m/0.20 mm/1.0 μm; Program: not specified |
Capillary | Polydimethyl siloxane | 987. | Spanier, Shahidi, et al., 2001 | Program: not specified |
Capillary | CP-Sil5 CB MS | 972. | Tirillini, Verdelli, et al., 2000 | 50. m/0.32 mm/0.4 μm; Program: 0C (3min) => 3C/min => 50C => 5C/min => 220C (30min) |
Capillary | Methyl Silicone | 966. | Estrada and Gutierrez, 1999 | Program: not specified |
Capillary | DB-5 | 985. | Yusuf, Begum, et al., 1998 | 30. m/0.25 mm/0.25 μm, He; Program: 60C => 3C/min => 240C => 30C/min => 300C |
Capillary | SPB-1 | 970. | Flanagan, Streete, et al., 1997 | 60. m/0.53 mm/5. μm, He; Program: 40C(6min) => 5C/min => 80C => 10C/min => 200C |
Capillary | DB-5 | 988. | Jean, Garneau, et al., 1993 | Column length: 30. m; Column diameter: 0.25 mm; Program: not specified |
Capillary | DB-5 | 977. | Storer, Elmore, et al., 1993 | 30. m/0.32 mm/1. μm; Program: 0C(5min) => 60C/min => 60C (5min) => 4C/min => 250C (5min) |
Capillary | SPB-1 | 970. | Strete, Ruprah, et al., 1992 | 60. m/0.53 mm/5.0 μm, Helium; Program: 40 0C (6 min) 5 0C/min -> 80 0C 10 0C/min -> 200 0C |
Capillary | DB-1 | 964. | Binder and Flath, 1989 | Column length: 60. m; Column diameter: 0.32 mm; Program: not specified |
Capillary | DB-1 | 962. | Takeoka, Flath, et al., 1988 | 30. m/0.25 mm/0.25 μm, H2; Program: 30C (2min) => 2C/min => 150C => 4C/min => 250C |
Capillary | DB-1 | 964. | Takeoka, Flath, et al., 1988 | 30. m/0.25 mm/0.25 μm, H2; Program: 30C (2min) => 2C/min => 150C => 4C/min => 250C |

Normal alkane RI, polar column, temperature ramp

Column type | Active phase | I | Reference | Comment |
---|---|---|---|---|
Capillary | AT-Wax | 1224. | Kiss, Csoka, et al., 2011 | 60. m/0.25 mm/0.25 μm, Helium, 4. K/min; Tstart: 60. C; Tend: 280. C |
Capillary | DB-Wax | 1253. | Karlsson, Birgersson, et al., 2009 | 30. m/0.25 mm/0.25 μm, Hydrogen, 30. C @ 5. min, 8. K/min, 230. C @ 10. min |
Capillary | CP-Wax | 1262. | Mo, Fan, et al., 2009 | 60. m/0.25 mm/0.25 μm, Helium, 50. C @ 2. min, 6. K/min, 230. C @ 15. min |
Capillary | ZB-Wax | 1291. | Zawirska-Wojtasiak, Siwulski, et al., 2009 | 60. m/0.53 mm/1.0 μm, Hydrogen, 8. K/min; Tstart: 60. C; Tend: 200. C |
Capillary | DB-Wax | 1249. | Beck, Higbee, et al., 2008 | 60. m/0.32 mm/0.25 μm, Helium, 30. C @ 4. min, 2. K/min, 200. C @ 30. min |
Capillary | DB-Wax | 1251. | Beck, Higbee, et al., 2008 | 60. m/0.32 mm/0.25 μm, Helium, 30. C @ 4. min, 2. K/min, 200. C @ 30. min |
Capillary | DB-Wax | 1264. | Kumazawa, Itobe, et al., 2008 | 30. m/0.25 mm/0.25 μm, He, 5. K/min; Tstart: 30. C; Tend: 210. C |
Capillary | HP-Innowax | 1251. | Thakeow, Angeli, et al., 2008 | 30. m/0.25 mm/0.25 μm, Helium, 50. C @ 1.5 min, 6.5 K/min, 250. C @ 10. min |
Capillary | CP Wax 52 CB | 1235. | Chen, Chyau, et al., 2007 | 60. m/0.25 mm/0.25 μm, Helium, 3. K/min; Tstart: 40. C; Tend: 220. C |
Capillary | Stabilwax | 1244. | Cros, Vandanjon, et al., 2007 | 60. m/0.25 mm/0.25 μm, Helium, 40. C @ 5. min, 3. K/min, 240. C @ 10. min |
Capillary | FFAP | 1287. | Nebesny, Budryn, et al., 2007 | 30. m/0.32 mm/0.5 μm, N2, 35. C @ 5. min, 4. K/min, 320. C @ 45. min |
Capillary | CP-Wax 52CB | 1262. | Povolo, Contarini, et al., 2007 | 60. m/0.32 mm/0.5 μm, He, 40. C @ 8. min, 4. K/min, 220. C @ 20. min |
Capillary | DB-Wax | 1247. | Lee, Umano, et al., 2005 | 30. m/0.25 mm/0.25 μm, He, 3. K/min, 180. C @ 40. min; Tstart: 50. C |
Capillary | Supelcowax-10 | 1277. | Rochat and Chaintreau, 2005 | 60. m/0.53 mm/1. μm, He, 40. C @ 2. min, 4. K/min, 240. C @ 20. min |
Capillary | Supelcowax-10 | 1277. | Rochat and Chaintreau, 2005 | 60. m/0.53 mm/1. μm, He, 40. C @ 2. min, 4. K/min, 240. C @ 20. min |
Capillary | Supelcowax-10 | 1280. | Rochat and Chaintreau, 2005 | 60. m/0.53 mm/1. μm, He, 40. C @ 2. min, 4. K/min, 240. C @ 20. min |
Capillary | ZB-Wax | 1236. | N/A | 30. m/0.32 mm/0.25 μm, Helium, 40. C @ 2. min, 5. K/min, 250. C @ 5. min |
Capillary | ZB-Wax | 1236. | Wu, Krings, et al., 2005 | 30. m/0.32 mm/0.25 μm, He, 40. C @ 2. min, 5. K/min, 250. C @ 10. min |
Capillary | Stabilwax | 1244. | Cros, Vandanjon, et al., 2003, 2 | 60. m/0.25 mm/0.25 μm, Helium, 40. C @ 5. min, 3. K/min, 240. C @ 10. min |
Capillary | DB-Wax | 1252. | Tanaka, Yamauchi, et al., 2003 | 30. m/0.25 mm/0.25 μm, 30. C @ 1. min, 4. K/min; Tend: 250. C |
Capillary | DB-Wax | 1253. | Tanaka, Yamauchi, et al., 2003 | 30. m/0.25 mm/0.25 μm, 30. C @ 1. min, 4. K/min; Tend: 250. C |
Capillary | RTX-Wax | 1273. | Galindo-Cuspinera, Lubran, et al., 2002 | 60. m/0.25 mm/0.5 μm, He, 40. C @ 5. min, 5. K/min, 180. C @ 20. min |
Capillary | DB-Wax | 1259. | Duque, Bonilla, et al., 2001 | 30. m/0.25 mm/0.25 μm, Helium, 4. K/min, 220. C @ 30. min; Tstart: 25. C |
Capillary | Supelcowax-10 | 1250. | Korány, Mednyánszky, et al., 2000 | 60. m/0.25 mm/0.25 μm, He, 4. K/min; Tstart: 60. C; Tend: 280. C |
Capillary | DB-Wax | 1252. | Umano, Hagi, et al., 2000 | 60. m/0.25 mm/0.25 μm, He, 40. C @ 2. min, 2. K/min; Tend: 200. C |
Capillary | PEG-20M | 1260. | Hirose, Joichi, et al., 1999 | N2, 3. K/min; Column length: 60. m; Column diameter: 0.25 mm; Tstart: 70. C; Tend: 220. C |
Capillary | DB-Wax | 1254. | Ngassoum, Yonkeu, et al., 1999 | 60. m/0.25 mm/0.25 μm, He, 4. K/min; Tstart: 60. C; Tend: 240. C |
Capillary | TC-Wax | 1252. | Shuichi, Masazumi, et al., 1996 | 80. C @ 5. min, 3. K/min; Column length: 60. m; Column diameter: 0.25 mm; Tend: 240. C |
Capillary | Carbowax 20M | 1242. | Kawakami and Kobayashi, 1991 | He, 60. C @ 4. min, 2. K/min; Column length: 50. m; Column diameter: 0.25 mm; Tend: 180. C |
Capillary | Carbowax 20M | 1264. | Tamura, Kihara, et al., 1990 | Nitrogen, 2. K/min; Column length: 50. m; Column diameter: 0.25 mm; Tstart: 80. C; Tend: 180. C |
Capillary | DB-Wax | 1248. | Binder and Flath, 1989 | 50. C @ 0.1 min, 4. K/min, 250. C @ 5. min; Column length: 60. m; Column diameter: 0.32 mm |
Capillary | Carbowax 20M | 1250. | Seifert and King, 1982 | He, 50. C @ 10. min, 1. K/min, 170. C @ 60. min; Column length: 150. m; Column diameter: 0.64 mm |
Capillary | Carbowax 20M | 1240. | Buttery and Kamm, 1980 | 50. C @ 30. min, 1. K/min; Column length: 150. m; Column diameter: 0.64 mm; Tend: 170. C |

Normal alkane RI, polar column, custom temperature program

Column type | Active phase | I | Reference | Comment |
---|---|---|---|---|
Capillary | Supelko CO Wax | 1235. | Vekiari, Orepoulou, et al., 2010 | 60. m/0.32 mm/0.25 μm, Helium; Program: 40 0C (5 min) 4 0C/min -> 75 0C 5 0C/min -> 250 0C (10 min) |
Capillary | DB-Wax | 1236. | Canuti, Conversano, et al., 2009 | 30. m/0.25 mm/0.25 μm, Helium; Program: 40 0C (4 min) 2.5 0C/min -> 80 0C 5 0C/min -> 110 0C 10 0C/min -> 220 0C (5 min) |
Capillary | DB-Wax | 1251. | Canuti, Conversano, et al., 2009 | 30. m/0.25 mm/0.25 μm, Helium; Program: not specified |
Capillary | DB-Wax | 1266. | Yongsheng, Hua, et al., 2008 | 30. m/0.32 mm/0.25 μm, Helium; Program: 40 0C (4 min) 3 0C/min -> 50 0C 5 0C/min -> 120 0C 7 0C/min -> 175 0C 10 0C/min -> 230 0C (8 min) |
Capillary | BP-20 | 1252. | Pontes, Marques, et al., 2007 | 30. m/0.25 mm/0.25 μm, He; Program: 50C(1min) => 2.5C/min => 100C => 2C/min => 180C => 15C/min => 220C |
Capillary | Innowax | 1266. | Junkes, Amboni, et al., 2004 | Program: not specified |
Capillary | DB-Wax | 1236. | Kim. J.H., Ahn, et al., 2004 | 60. m/0.25 mm/0.25 μm, Helium; Program: 60 0C (3 min) 2 0C/min -> 150 0C 4 0C/min -> 200 0C |
Capillary | DB-Wax | 1264. | le Pape, Grua-Priol, et al., 2004 | 30. m/0.32 mm/0.5 μm, He; Program: 40C => 1C/min => 57C => 15C/min => 230C (5min) |
Capillary | Carbowax 20M | 1255. | Vinogradov, 2004 | Program: not specified |
Capillary | DB-Wax | 1265. | Piveteau, le Guen, et al., 2000 | 60. m/0.32 mm/0.5 μm, He; Program: 50C(6min) => 1C/min => 130C => 10C/min => 240C (15min) |
Capillary | DB-Wax | 1230. | Caldentey, Daria Fumi, et al., 1998 | 30. m/0.25 mm/0.25 μm, He; Program: 25C(8min) => 4C/min => 60C => 6C/min => 160C => 20C/min => 200C |
Capillary | CP-Wax 52CB | 1249. | Jakobsen, Hansen, et al., 1998 | 50. m/0.25 mm/0.2 μm, He; Program: 30C (1.5min) => 3C/min => 120C => 10C/min => 220C (3.5min) |
Capillary | Supelcowax 10 | 1248. | Castioni and Kapetanidis, 1996 | 60. m/0.25 mm/0.25 μm, Helium; Program: 60 0C (10 min) 2 0C/min -> 80 0C 3 0C/min -> 100 0C 4 0C/min -> 220 0C (30 min) |
Capillary | Supelcowax 10 | 1251. | Castioni and Kapetanidis, 1996 | 60. m/0.25 mm/0.25 μm, Helium; Program: not specified |
Capillary | Supelcowax 10 | 1257. | Castioni and Kapetanidis, 1996 | 60. m/0.25 mm/0.25 μm, Helium; Program: not specified |
Capillary | CP-Wax 52CB | 1253. | Luning, de Rijk, et al., 1994 | 50. m/0.32 mm/1.5 μm; Program: 40C => 2C/min => 150C => 10C/min => 250C |
Capillary | Supelcowax-10 | 1256. | Jean, Garneau, et al., 1993 | Column length: 30. m; Column diameter: 0.25 mm; Program: not specified |
Capillary | DB-Wax | 1252. | Peng, Yang, et al., 1991 | Program: not specified |
Capillary | DB-Wax | 1251. | Binder and Flath, 1989 | Column length: 60. m; Column diameter: 0.32 mm; Program: not specified |

References

Geiseler and Ratzsch, 1965
Geiseler, V.G.; Ratzsch, M.,
Bildungsenthalpien stellungsisomerer n-Alkanderivate. 1. Mitteilung: Bildungsenthalpien des Octanals und der drei isomeren Octanone,
Ber. Bunsen-Ges. Phys. Chem., 1965, 69, 485-488. [all data]
Pulliam, Gude, et al., 1994
Pulliam, M.K.; Gude, M.T.; Teja, A.S.,
The Critical Properties of Twelve Isomeric n-Alkanones with Six to Nine Carbon Atoms,
Experimental Results for DIPPR 1990-91 Projects on Phase Equilibria and Pure Component Properties, 1994, 1994, DIPPR Data Ser. No. 2, p. 184-87. [all data]
Stephenson and Malanowski, 1987
Stephenson, Richard M.; Malanowski, Stanislaw,
Handbook of the Thermodynamics of Organic Compounds, 1987, https://doi.org/10.1007/978-94-009-3173-2
. [all data]
Yeo and Williams, 1969
Yeo, A.N.H.; Williams, D.H.,
Internal hydrogen rearrangement as a function of ion lifetime in the mass spectra of aliphatic ketones,
J. Am. Chem. Soc., 1969, 91, 3582. [all data]
Hu, Lu, et al., 2006
Hu, X.-F.; Lu, C.-H.; Yin, C.-S.,
Modeling Gas Chromatographic Retention Indices of Oxygen-containing Compounds by Novel Atom-type Topological Indices,
Chinese Journal of Chemical Physics, 2006, 19, 3, 243-247, https://doi.org/10.1360/cjcp2006.19(3).243.5
. [all data]
Héberger and Görgényi, 1999
Héberger, K.; Görgényi, M.,
Principal component analysis of Kováts indices for carbonyl compounds in capillary gas chromatography,
J. Chromatogr., 1999, 845, 1-2, 21-31, https://doi.org/10.1016/S0021-9673(99)00323-4
. [all data]
Wehrli and Kováts, 1959
Wehrli, A.; Kováts, E.,
Gas-chromatographische Charakterisierung ogranischer Verbindungen. Teil 3: Berechnung der Retentionsindices aliphatischer, alicyclischer und aromatischer Verbindungen,
Helv. Chim. Acta, 1959, 7, 7, 2709-2736, https://doi.org/10.1002/hlca.19590420745
. [all data]
Tzakou and Couladis, 2001
Tzakou, O.; Couladis, M.,
The essential oil of Micromeria graeca (L.) Bentham et Reichenb. growing in Greece,
Flavour Fragr. J., 2001, 16, 2, 107-109, https://doi.org/10.1002/ffj.955
. [all data]
Takeoka, Perrino, et al., 1996
Takeoka, G.; Perrino, C., Jr.; Buttery, R.,
Volatile constituents of used frying oils,
J. Agric. Food Chem., 1996, 44, 3, 654-660, https://doi.org/10.1021/jf950430m
. [all data]
Tamura, Kihara, et al., 1991
Tamura, H.; Kihara, S.; Nakahara, K.; Sugisawa, H.,
A program for predicting aliphatic compounds using linear equations of GC retention index value,
Nippon Shokuhin Kogyo Gakkaishi, 1991, 38, 10, 934-939, https://doi.org/10.3136/nskkk1962.38.934
. [all data]
Ohnishi and Shibamoto, 1984
Ohnishi, S.; Shibamoto, T.,
Volatile compounds from heated beef fat and beef fat with glycine,
J. Agric. Food Chem., 1984, 32, 5, 987-992, https://doi.org/10.1021/jf00125a008
. [all data]
Rojas and Usubillaga, 2000
Rojas, L.B.; Usubillaga, A.,
Composition of the essential oil fo Satureja brownei (SW.) Briq. from Venezuela,
Flavour Fragr. J., 2000, 15, 1, 21-22, https://doi.org/10.1002/(SICI)1099-1026(200001/02)15:1<21::AID-FFJ861>3.0.CO;2-G
. [all data]
Chandravadana, Vekateshwarlu, et al., 2005
Chandravadana, M.V.; Vekateshwarlu, G.; Bujji Babu, C.S.; Roy, T.K.; Shivashankara, K.S.; Pandey, M.; Tewari, R.P.; Selvaraj, Y.,
Volatile flavour components of dry milky mushrooms (Calocybe indica),
Flavour Fragr. J., 2005, 20, 6, 715-717, https://doi.org/10.1002/ffj.1653
. [all data]
Venkateshwarlu, Chandravadana, et al., 1999
Venkateshwarlu, G.; Chandravadana, M.V.; Tewari, R.P.,
Volatile flavour components of some edible mushrooms (Basidiomycetes),
Flavour Fragr. J., 1999, 14, 3, 191-194, https://doi.org/10.1002/(SICI)1099-1026(199905/06)14:3<191::AID-FFJ810>3.0.CO;2-7
. [all data]
Chen, Chen, et al., 1984
Chen, C.-C.; Chen, S.-D.; Chen, J.-J.; Wu, C.-M.,
Effects of pH value on the formation of volatiles of shiitake (Lentinus edodes), and edible mushroom,
J. Agric. Food Chem., 1984, 32, 5, 999-1001, https://doi.org/10.1021/jf00125a011
. [all data]
Buttery, Kamm, et al., 1982
Buttery, R.G.; Kamm, J.A.; Ling, L.C.,
Volatile components of alfalfa flowers and pods,
J. Agric. Food Chem., 1982, 30, 4, 739-742, https://doi.org/10.1021/jf00112a028
. [all data]
Bendahou, Muselli, et al., 2008
Bendahou, M.; Muselli, A.; Grignon-Dubois, M.; Benyoucef, M.; Desjobert, J.-M.; Bernardini, A.-F.; Costa, J.,
Antimicrobial activity and chemical composition of Origanum glandulosum Desf. essential oil and extract obtained by microwave extraction: Comparison with hydrodistillation,
Food Chem., 2008, 106, 1, 132-139, https://doi.org/10.1016/j.foodchem.2007.05.050
. [all data]
Cho, Namgung, et al., 2008
Cho, I.H.; Namgung, H.-J.; Choi, H.-K.; Kim, Y.-S.,
Volatiles and key odorants in the pileus and stipe of pine-mushroom (Tricholoma matsutake Sing.),
Food Chem., 2008, 106, 1, 71-76, https://doi.org/10.1016/j.foodchem.2007.05.047
. [all data]
Cho I.H., Lee S.M., et al., 2007
Cho I.H.; Lee S.M.; Kim S.Y.; Choi H.K.; Kim K.O.; Kim Y.S.,
Differentiation of aroma characteristics of pine-mushrooms (Tricholoma matsutake Sing.) of different grades using gas chromatography-olfactometry and sensory analysis,
J. Agric. Food Chem., 2007, 55, 6, 2323-2328, https://doi.org/10.1021/jf062702z
. [all data]
Vagionas, Ngassapa, et al., 2007
Vagionas, K.; Ngassapa, O.; Runyoro, D.; Graikou, K.; Gortzi, O.; Chinou, I.,
Chemical analysis of edible aromatic plants growing in Tanzania,
Food Chem., 2007, 105, 4, 1711-1717, https://doi.org/10.1016/j.foodchem.2007.05.029
. [all data]
Cho, Kim, et al., 2006
Cho, I.H.; Kim, S.Y.; Choi, H.-K.; Kim, Y.-S.,
Characterization of Aroma-Active Compounds in Raw and Cooked Pine-Mushrooms (Tricholoma matsutake Sing.),
J. Agric. Food Chem., 2006, 54, 17, 6332-6335, https://doi.org/10.1021/jf060824l
. [all data]
Pinto, Pina-Vaz, et al., 2006
Pinto, E.; Pina-Vaz, C.; Salgueiro, L.; Goncalves, M.J.; Costa-de-Oliveira, S.; Cavaleiro, C.; Palmeira, A.; Rodrigues, A.; Martinez-de-Oliveira, J.,
Antifuncal activity of the essential oil Thymus pulegioides on Candida, Aspergillus and dermatophyte species,
Journal of Medical Microbiology, 2006, 55, 10, 1367-1373, https://doi.org/10.1099/jmm.0.46443-0
. [all data]
Zhao C.X., Li, et al., 2006
Zhao C.X.; Li, X.N.; Liang Y.Z.; Fang H.Z.; Huang L.F.; Guo F.Q.,
Comparative analysis of chemical components of essential oils from different samples of Rhododendron with the help of chemometrics methods,
Chemom. Intell. Lab. Syst., 2006, 82, 1-2, 218-228, https://doi.org/10.1016/j.chemolab.2005.08.008
. [all data]
Ziegenbein, Hanssen, et al., 2006
Ziegenbein, F.C.; Hanssen, H.-P.; König, W.A.,
Secondary metabolites from Ganoderma lucidum and Spongiporus leucomallellus,
Phytochemistry, 2006, 67, 2, 202-211, https://doi.org/10.1016/j.phytochem.2005.10.025
. [all data]
Ziegenbein, Hanssen, et al., 2006, 2
Ziegenbein, F.C.; Hanssen, H.-P.; König, W.A.,
Chemical constituents of the essential oils of three wood-rotting fungi,
Flavour Fragr. J., 2006, 21, 5, 813-816, https://doi.org/10.1002/ffj.1732
. [all data]
Brantner, Pfeifhofer, et al., 2005
Brantner, A.H.; Pfeifhofer, H.W.; Ercegovac, O.; Males, Z.; Plazibat, M.,
Essential oil composition and antioxidant activity of Thymus bracteosus Vis. ex Benth.,
Flavour Fragr. J., 2005, 20, 6, 596-600, https://doi.org/10.1002/ffj.1494
. [all data]
Flamini, Luigi Cioni, et al., 2005
Flamini, G.; Luigi Cioni, P.; Morelli, I.,
Composition of the essential oils and in vivo emission of volatiles of four Lamium species from Italy: L. purpureum, L. hybridum, L. bifidum and L. amplexicaule,
Food Chem., 2005, 91, 1, 63-68, https://doi.org/10.1016/j.foodchem.2004.05.047
. [all data]
Javidnia, Miri, et al., 2005
Javidnia, K.; Miri, R.; Jamalian, A.,
Composition of the essential oil of Salvia macrosiphon Boiss. from Iran,
Flavour Fragr. J., 2005, 20, 5, 542-543, https://doi.org/10.1002/ffj.1468
. [all data]
Wu, Zorn, et al., 2005
Wu, S.; Zorn, H.; Krings, U.; Berger, R.G.,
Characteristic Volatiles from Young and Aged Fruiting Bodies of Wild Polyporus sulfureus (Bull.:Fr.) Fr.,
J. Agric. Food Chem., 2005, 53, 11, 4524-4528, https://doi.org/10.1021/jf0478511
. [all data]
Bertoli, Pistelli, et al., 2004
Bertoli, A.; Pistelli, L.; Morelli, I.; Fraternale, D.; Giamperi, L.; Ricci, D.,
Volatile constituents of different parts (roots, stems and leaves) of Smyrnium olusatrum L.,
Flavour Fragr. J., 2004, 19, 6, 522-525, https://doi.org/10.1002/ffj.1382
. [all data]
Dickschat, Wenzel, et al., 2004
Dickschat, J.S.; Wenzel, S.C.; Bode, H.B.; Muller, R.; Schulz, S.,
Biosynthesis of Volatiles by the Myxobacterium Myxococcus xanthus,
ChemBioChem, 2004, 5, 6, 778-787, https://doi.org/10.1002/cbic.200300813
. [all data]
Flamini, Luigi Cioni, et al., 2004
Flamini, G.; Luigi Cioni, P.; Morelli, I.,
Essential oils of Galeopsis pubescens and G. tetrahit from Tuscany (Italy),
Flavour Fragr. J., 2004, 19, 4, 327-329, https://doi.org/10.1002/ffj.1307
. [all data]
Javidnia, Miri, et al., 2004
Javidnia, K.; Miri, R.; Kamalinejad, M.; Sarkarzadeh, H.; Jamalian, A.,
Chemical composition of the essential oils of Anthemis altissima L. grown in Iran,
Flavour Fragr. J., 2004, 19, 3, 213-216, https://doi.org/10.1002/ffj.1277
. [all data]
Javidnia, Miri, et al., 2004, 2
Javidnia, K.; Miri, R.; Sadeghpour, H.,
Composition of the volatile oil of Achillea wilhelmsii C. Koch from Iran,
DARU, 2004, 12, 2, 63-66, retrieved from http://www1.tums.ac.ir/daru/. [all data]
Pino, Marbot, et al., 2004
Pino, J.A.; Marbot, R.; Rosado, A.; Vázquez, C.,
Volatile constituents of Malay rose apple [Syzygium malaccense (L.) Merr. Perry],
Flavour Fragr. J., 2004, 19, 1, 32-35, https://doi.org/10.1002/ffj.1269
. [all data]
Bader, Caponi, et al., 2003
Bader, A.; Caponi, C.; Cioni, P.L.; Flamini, G.; Morelli, I.,
Composition of the essential oil of Ballota undulata, B. nigra ssp. foetida and B. saxatilis,
Flavour Fragr. J., 2003, 18, 6, 502-504, https://doi.org/10.1002/ffj.1257
. [all data]
Salido, Altarejos, et al., 2003
Salido, S.; Altarejos, J.; Nogueras, M.; Sánchez, A.; Luque, P.,
Chemical composition and seasonal variations of rosemary oil from Southern Spain,
J. Essent. Oil Res., 2003, 15, 1, 10-14, https://doi.org/10.1080/10412905.2003.9712248
. [all data]
Javidnia, Miri, et al., 2002
Javidnia, K.; Miri, R.; Safavi, F.; Azarpira, A.; Shafiee, A.,
Composition of the essential oil of Nepeta persica Boiss from Iran,
Flavour Fragr. J., 2002, 17, 1, 20-22, https://doi.org/10.1002/ffj.1023
. [all data]
Miri, Ramezani, et al., 2002
Miri, R.; Ramezani, M.; Javidnia, K.; Ahmadi, L.,
Composition of the volatile oil of Thymus transcaspicus Klokov from Iran,
Flavour Fragr. J., 2002, 17, 4, 245-246, https://doi.org/10.1002/ffj.1104
. [all data]
Shellie, Mondello, et al., 2002
Shellie, R.; Mondello, L.; Marriott, P.; Dugo, G.,
Characterisation of lavender essential oils by using gas chromatography-mass spectrometry with correlation of linear retention indices and comparison with comprehensive two-dimensional gas chromatography,
J. Chromatogr. A, 2002, 970, 1-2, 225-234, https://doi.org/10.1016/S0021-9673(02)00653-2
. [all data]
Aligiannis, Kalpoutzakis, et al., 2001
Aligiannis, N.; Kalpoutzakis, E.; Mitaku, S.; Chinou, I.B.,
Composition and antimicrobial activity of the essential oils of two Origanum species,
J. Agric. Food Chem., 2001, 49, 9, 4168-4170, https://doi.org/10.1021/jf001494m
. [all data]
Skaltsa, Mavrommati, et al., 2001
Skaltsa, H.D.; Mavrommati, A.; Constantinidis, T.,
A chemotaxonomic investigation of volatile constituents in Stachys subsect. Swainsonianeae (Labiatae),
Phytochemistry, 2001, 57, 2, 235-244, https://doi.org/10.1016/S0031-9422(01)00003-6
. [all data]
Specht and Baltes, 1994
Specht, K.; Baltes, W.,
Identification of volatile flavor compounds with high aroma values from shallow-fried beef,
J. Agric. Food Chem., 1994, 42, 10, 2246-2253, https://doi.org/10.1021/jf00046a031
. [all data]
Hendriks and Bruins, 1983
Hendriks, H.; Bruins, A.P.,
A tentative identification of components in the essential oil of Cannabis sativa L. by a combination of gas chromatography negative ion chemical ionization mass spectrometry and retention indices,
Biomed. Mass Spectrom., 1983, 10, 6, 377-381, https://doi.org/10.1002/bms.1200100607
. [all data]
Bruni, Bianchi, et al., 2007
Bruni, R.; Bianchi, A.; Bellardi, M.G.,
Essential oil composition of Agastache anethiodora Britton (Lamiaceae) infected by cucumber mosaic virus (CMV),
Flavour Fragr. J., 2007, 22, 1, 66-70, https://doi.org/10.1002/ffj.1760
. [all data]
Sacchetti, Maietti, et al., 2005
Sacchetti, G.; Maietti, S.; Muzzoli, M.; Scaglianti, M.; Manfredini, S.; Radice, M.; Bruni, R.,
Comparative evaluation of 11 essential oils of different origin as functional antioxidants, antiradicals and antimicrobials in foods,
Food Chem., 2005, 91, 4, 621-632, https://doi.org/10.1016/j.foodchem.2004.06.031
. [all data]
Boué, Shih, et al., 2003
Boué, S.M.; Shih, B.Y.; Carter-Wientjes, C.H.; Cleveland, T.E.,
Identification of volatile compounds in soybean at various developmental stages using solid phase microextraction,
J. Agric. Food Chem., 2003, 51, 17, 4873-4876, https://doi.org/10.1021/jf030051q
. [all data]
Lorenzo, Paz, et al., 2002
Lorenzo, D.; Paz, D.; Dellacassa, E.; Davies, P.; Vila, R.; Cañigueral, S.,
Essential oils of Mentha pulegium and Mentha rotundifolia from Uruguay,
Braz. Arch. Biol. Technol., 2002, 45, 4, 519-524, https://doi.org/10.1590/S1516-89132002000600016
. [all data]
Kubícková and Grosch, 1997
Kubícková, J.; Grosch, W.,
Evaluation of potent odorants of camembert cheese by dilution and concentration techniques,
Int. Dairy J., 1997, 7, 1, 65-70, https://doi.org/10.1016/S0958-6946(96)00044-1
. [all data]
Owens J.D., Allagheny N., et al., 1997
Owens J.D.; Allagheny N.; Kipping G.; Ames J.M.,
Formation of volatile compounds during Bacillus subtilis fermentation of soya beans,
J. Sci. Food Agric., 1997, 74, 1, 132-140, https://doi.org/10.1002/(SICI)1097-0010(199705)74:1<132::AID-JSFA779>3.0.CO;2-8
. [all data]
Cho, Choi, et al., 2006
Cho, I.H.; Choi, H.-K.; Kim, Y.-S.,
Difference in the volatile composition of pine-mushrooms (Tricholoma matsutake Sing.) according to their grades,
J. Agric. Food Chem., 2006, 54, 13, 4820-4825, https://doi.org/10.1021/jf0601416
. [all data]
Fernandez-Segovia, Escriche, et al., 2006
Fernandez-Segovia, I.; Escriche, I.; Gomez-Sintes, M.; Fuentes, A.; Serra, J.A.,
In?uence of di?erent preservation treatments on the volatile fraction of desalted cod,
Food Chem., 2006, 98, 3, 473-482, https://doi.org/10.1016/j.foodchem.2005.06.021
. [all data]
Ledauphin, Basset, et al., 2006
Ledauphin, J.; Basset, B.; Cohen, S.; Payot, T.; Barillier, D.,
Identification of trace volatile compounds in freshly distilled Calvados and Cognac: Carbonyl and sulphur compounds,
J. Food Comp. Anal., 2006, 19, 1, 28-40, https://doi.org/10.1016/j.jfca.2005.03.001
. [all data]
Cros, Lignot, et al., 2005
Cros, S.; Lignot, B.; Bourseau, P.; Jaouen, P.; Prost, C.,
Desalination of mussel cooking juices by electrodialysis: effect on the aroma profile,
J. Food Eng., 2005, 69, 4, 425-436, https://doi.org/10.1016/j.jfoodeng.2004.08.036
. [all data]
Riu-Aumatell, Lopez-Tamames, et al., 2005
Riu-Aumatell, M.; Lopez-Tamames, E.; Buxaderas, S.,
Assessment of the Volatile Composition of Juices of Apricot, Peach, and Pear According to Two Pectolytic Treatments,
J. Agric. Food Chem., 2005, 53, 20, 7837-7843, https://doi.org/10.1021/jf051397z
. [all data]
Ledauphin, Saint-Clair, et al., 2004
Ledauphin, J.; Saint-Clair, J.-F.; Lablanquie, O.; Guichard, H.; Founier, N.; Guichard, E.; Barillier, D.,
Identification of trace volatile compounds in freshly distilled calvados and cognac using preparative separations coupled with gas chromatography-mass spectrometry,
J. Agric. Food Chem., 2004, 52, 16, 5124-5134, https://doi.org/10.1021/jf040052y
. [all data]
Nielsen, Larsen, et al., 2004
Nielsen, G.S.; Larsen, L.M.; Poll, L.,
Formation of aroma compounds during long-term frozen storage of unblanched leek (Allium ampeloprasum Var. Bulga) as affected by packaging atmosphere and slice thickness,
J. Agric. Food Chem., 2004, 52, 5, 1234-1240, https://doi.org/10.1021/jf0306183
. [all data]
Nielsen, Larsen, et al., 2004, 2
Nielsen, G.S.; Larsen, L.M.; Poll, L.,
Impact of blanching and packaging atmosphere on the formation of aroma compounds during long-term frozen storage of leek (Allium ampeloprasum Var. Bulga) slices,
J. Agric. Food Chem., 2004, 52, 15, 4844-4852, https://doi.org/10.1021/jf049623c
. [all data]
Cros, Vandanjon, et al., 2003
Cros, S.; Vandanjon, L.; Jaouen, P.; Bourseau, P.,
Processing of industrial mussel cooking juices by reverse osmosis: pollution abatement and aromas recovery, 2003, retrieved from http://www.membrane.unsw.edu.au/imstec03/content/papers/DAI/imstec064.pdf. [all data]
Nielsen, Larsen, et al., 2003
Nielsen, G.S.; Larsen, L.M.; Poll, L.,
Formation of aroma compounds and lipoxygenase (EC 1.13.11.12) activity in unblanced leek (Allium ampeloprasum Var. Bulga) slices during long-term frozen storage,
J. Agric. Food Chem., 2003, 51, 7, 1970-1976, https://doi.org/10.1021/jf020921o
. [all data]
Chung, Yung, et al., 2002
Chung, H.-Y.; Yung, I.K.S.; Ma, W.C.J.; Kim, J.-S.,
Analysis of volatile components in frozen and dried scallops (Patinopecten yessoensis) by gas chromatography/mass spectrometry,
Food Res. Int., 2002, 35, 1, 43-53, https://doi.org/10.1016/S0963-9969(01)00107-7
. [all data]
Chung, Yung, et al., 2001
Chung, H.Y.; Yung, I.K.S.; Kim, J.-S.,
Comparison of volatile components in dried scallops (Chlamys farreri and Patinopecten yessoensis) prepared by boiling and steaming methods,
J. Agric. Food Chem., 2001, 49, 1, 192-202, https://doi.org/10.1021/jf000692a
. [all data]
Beauchene, Grua-Priol, et al., 2000
Beauchene, D.; Grua-Priol, J.; Lamer, T.; Demaimay, M.; Quemeneur, F.,
Concentration by pervaporation of aroma compounds from Fucus serratus,
J. Sci. Food Agric., 2000, 75, 451-458. [all data]
Chung, 2000
Chung, H.Y.,
Volatile flavor components in red fermented soybean (Glycine max) curds,
J. Agric. Food Chem., 2000, 48, 5, 1803-1809, https://doi.org/10.1021/jf991272s
. [all data]
Chung, 1999
Chung, H.Y.,
Volatile components in fermented soybean (Glycine max) curds,
J. Agric. Food Chem., 1999, 47, 7, 2690-2696, https://doi.org/10.1021/jf981166a
. [all data]
Mau, Lin, et al., 1998
Mau, J.-L.; Lin, Y.-P.; Chen, P.-T.; Wu, Y.-H.; Peng, J.-T.,
Flavor compounds in king oyster mushrooms Pleurotus eryngii,
J. Agric. Food Chem., 1998, 46, 11, 4587-4591, https://doi.org/10.1021/jf980508+
. [all data]
Mau and Hwang, 1997
Mau, J.-L.; Hwang, S.-J.,
Effect of γ-irradiation on flavor compounds of fresh mushrooms,
J. Agric. Food Chem., 1997, 45, 5, 1849-1852, https://doi.org/10.1021/jf960560a
. [all data]
Ott, Fay, et al., 1997
Ott, A.; Fay, L.B.; Chaintreau, A.,
Determination and origin of the aroma impact compounds of yogurt flavor,
J. Agric. Food Chem., 1997, 45, 3, 850-858, https://doi.org/10.1021/jf960508e
. [all data]
Wu and Liou, 1992
Wu, C.-M.; Liou, S.-E.,
Volatile components of water-boiled duck meat and Cantonese style roasted duck,
J. Agric. Food Chem., 1992, 40, 5, 838-841, https://doi.org/10.1021/jf00017a026
. [all data]
Tanchotikul and Hsieh, 1989
Tanchotikul, U.; Hsieh, T.C.-Y.,
Volatile Flavor Components in Crayfish Waste,
J. Food Sci., 1989, 54, 6, 1515-1520, https://doi.org/10.1111/j.1365-2621.1989.tb05149.x
. [all data]
Salter L.J., Mottram D.S., et al., 1988
Salter L.J.; Mottram D.S.; Whitfield,
Volatile compounds produces in Maillard reactions involving glycine, ribose and phospholid,
J. Sci. Food Agric., 1988, 46, 2, 227-242, https://doi.org/10.1002/jsfa.2740460211
. [all data]
Bianchi, Cantoni, et al., 2007
Bianchi, F.; Cantoni, C.; Careri, M.; Chiesa, L.; Musci, M.; Pinna, A.,
Characterization of the aromatic profile for the authentication and differentiation of typical Italian dry-sausages,
Talanta, 2007, 72, 4, 1552-1563, https://doi.org/10.1016/j.talanta.2007.02.019
. [all data]
Bianchi, Careri, et al., 2007
Bianchi, F.; Careri, M.; Mangia, A.; Musci, M.,
Retention indices in the analysis of food aroma volatile compounds in temperature-programmed gas chromatography: Database creation and evaluation of precision and robustness,
J. Sep. Sci., 2007, 39, 4, 563-572, https://doi.org/10.1002/jssc.200600393
. [all data]
Pennarun, Prost, et al., 2003
Pennarun, A.-L.; Prost, C.; Haure, J.; Demaimay, M.,
Comparison of two microalgal diets. 2. Influence on odorant composition and organoleptic qualities of raw oysters (Crassostrea gigas),
J. Agric. Food Chem., 2003, 51, 7, 2011-2018, https://doi.org/10.1021/jf020549c
. [all data]
Pennarun, Prost, et al., 2002
Pennarun, A.L.; Prost, C.; Demaimay, M.,
Identification and origin of the character-impact compounds of raw oyster Crassostrea gigas,
J. Sci. Food Agric., 2002, 82, 14, 1652-1660, https://doi.org/10.1002/jsfa.1236
. [all data]
Cantergiani, Brevard, et al., 2001
Cantergiani, E.; Brevard, H.; Krebs, Y.; Feria-Morales, A.; Amadò, R.; Yeretzian, C.,
Characterisation of the aroma of green Mexican coffee and identification of mouldy/earthy defect,
Eur. Food Res. Technol., 2001, 212, 6, 648-657, https://doi.org/10.1007/s002170100305
. [all data]
Yang, Chyau, et al., 1998
Yang, M.-S.; Chyau, C.-C.; Horng, D.-T.; Yang, J.-S.,
Effects of Irradiation and Drying on Volatile Components of Fresh Shiitake edodes (Lentinus Sing),
J. Sci. Food Agric., 1998, 76, 1, 72-76, https://doi.org/10.1002/(SICI)1097-0010(199801)76:1<72::AID-JSFA921>3.0.CO;2-0
. [all data]
Amboni, Junkes, et al., 2002
Amboni, R.D.DeM.C.; Junkes, B. daS.; Yunes, R.A.; Heinzen, V.E.F.,
Quantitative structure-property relationships study of chromatographic retention indices and normal boiling points for oxo compounds using the semi-empirical topological method,
J. Mol. Struct. (Theochem), 2002, 586, 1-3, 71-80, https://doi.org/10.1016/S0166-1280(02)00062-3
. [all data]
Goeminne, Vandendriessche, et al., 2012
Goeminne, P.C.; Vandendriessche, T.; Van Eldere, J.; Nicolai, B.M.; Hertog, M.L.; Dupont, L.J.,
Detection of Pseudomonas aeruginosa in sputum headspace through volatile organic compound analysis,
Respiratory Res., 2012, 13, 87, 1-9. [all data]
Fathi, Sahari, et al., 2011
Fathi, A.; Sahari, M.A.; Zangiabadi, M.; Barzegar, M.,
Application od Satureja hortensis L. and Zataria multiflora Boiss. essential oils as two natural antioxidants in soybean oil during microwave heating,
J. Medicinal Plants, 2011, 10, 39, 12-21. [all data]
Leffingwell and Alford, 2011
Leffingwell, J.; Alford, E.D.,
Volatile constituents of the giant pufball mushroom (Calvatia gigantea),
Leffingwell Rep., 2011, 4, 1-17. [all data]
Miyazawa, Marumoto, et al., 2011
Miyazawa, M.; Marumoto, S.; Kobayashi, T.; Yoshida, S.; Utsumi, Y.,
Determination of characteristic components in essential oils from Wisteria braphybotrys using gas chromatography - olfactometry incremental dilution technique,
Rec. Nat. Prod., 2011, 5, 3, 221-227. [all data]
Radulovic, Dordevic, et al., 2010
Radulovic, N.; Dordevic, N.; Markovic, M.; Palic, R.,
Volatile constituents of Glechoma Hirsuta Waldst. Kit. and G. Hederacea L. (Lamiaceae),
Bull. Chem. Soc. Ethiop., 2010, 24, 1, 67-76, https://doi.org/10.4314/bcse.v24i1.52962
. [all data]
Xu, Tang, et al., 2010
Xu, X.; Tang, Z.; Liang, Y.,
Comparative analysis of plant essential oils by GC-MS coupled with integrated chemometric resolution methods,
Anal. Methods, 2010, 2, 4, 359-367, https://doi.org/10.1039/b9ay00213h
. [all data]
Farhat, Ginies, et al., 2009
Farhat, A.; Ginies, C.; Romdhane, M.; Chemat, F.,
Eco-friendly and cleaner process for isolation of essential oil usung microwave energy. Experimantal and theoretical study.,
J. Chromatogr. A., 2009, 1216, 26, 5077-5085, https://doi.org/10.1016/j.chroma.2009.04.084
. [all data]
Porto, Decorti, et al., 2009
Porto, C.Da.; Decorti, D.; Kikic, I.,
Flavour compounds of Lavandula angustifolia L. to use in food manufacturing: comparison of three different extraction methods,
Food Chem., 2009, 112, 4, 1072-1078, https://doi.org/10.1016/j.foodchem.2008.07.015
. [all data]
Sahraoui, Vian, et al., 2008
Sahraoui, N.; Vian, M.A.; Bornard, I.; Boutekedjiret, C.; Chemat, F.,
Improved microwave steam distillation apparatus for isolation of essential oils. Comparison with conventional steam distillation,
J. Chromatogr. A., 2008, 1210, 2, 229-233, https://doi.org/10.1016/j.chroma.2008.09.078
. [all data]
Thakeow, Angeli, et al., 2008
Thakeow, P.; Angeli, S.; Weissbecker, B.; Schutz, S.,
Antennal and behavioral responses of Cis boleti to fungal odor of Trametes gibbosa,
Chem. Senses, 2008, 33, 4, 379-387, https://doi.org/10.1093/chemse/bjn005
. [all data]
Berdague, Tournayre, et al., 2007
Berdague, J.L.; Tournayre, P.; Cambou, S.,
Novel multi-gas chromatography?olfactometry device and software for the identification of odour-active compounds,
J. Chromatogr. A, 2007, 1146, 1, 85-92, https://doi.org/10.1016/j.chroma.2006.12.102
. [all data]
Salehi, Fakhari, et al., 2007
Salehi, P.; Fakhari, A.R.; Ebrahimi, S.N.; Heydari, R.,
Rapid essential oil screening of Rosmarinus officinalis L. by hydrodistillation-headspace solvent microextraction,
Flavour Fragr. J., 2007, 22, 4, 280-285, https://doi.org/10.1002/ffj.1793
. [all data]
Setkova, Risticevic, et al., 2007
Setkova, L.; Risticevic, S.; Pawliszyn, J.,
Rapid headspace solid-phase microextraction-gas chromatographic?time-of-flight mass spectrometric method for qualitative profiling of ice wine volatile fraction II: Classification of Canadian and Czech ice wines using statistical evaluation of the data,
J. Chromatogr. A, 2007, 1147, 2, 224-240, https://doi.org/10.1016/j.chroma.2007.02.052
. [all data]
Vagionas, Graikou, et al., 2007
Vagionas, K.; Graikou, K.; Ngassapa, O.; Runyoro, D.; Chinou, I.,
Composition and antimicrobial activity of the essential oils of three Satureja species growing in Tansania,
Food Chem., 2007, 103, 2, 319-324, https://doi.org/10.1016/j.foodchem.2006.07.051
. [all data]
Vasta, Ratel, et al., 2007
Vasta, V.; Ratel, J.; Engel, E.,
Mass Spectrometry Analysis of Volatile Compounds in Raw Meat for the Authentication of the Feeding Background of Farm Animals,
J. Agric. Food Chem., 2007, 55, 12, 4630-4639, https://doi.org/10.1021/jf063432n
. [all data]
Figuérédo, Cabassu, et al., 2006
Figuérédo, G.; Cabassu, P.; Chalchat, J.-C.; Pasquier, B.,
Studies of Mediterranean oregano populations. VIII. Chemical composition of essential oils of oreganos of various origins,
Flavour Fragr. J., 2006, 21, 1, 134-139, https://doi.org/10.1002/ffj.1543
. [all data]
Jiménez, Aguilera, et al., 2006
Jiménez, A.; Aguilera, M.P.; Beltrán, G.; Uceda, M.,
Application of solid-phase microextraction to virgin olive oil quality control,
J. Chromatogr. A, 2006, 1121, 1, 140-144, https://doi.org/10.1016/j.chroma.2006.05.005
. [all data]
Sari M., Biondi D.M., et al., 2006
Sari M.; Biondi D.M.; Kaabeche M.; Mandalari G.; D'Arrigo M.; Bisignano G.; Saija A.; Daquino C.; Ruberto G.,
Chemical composition, antimicrobial and antioxidant activities of the essential oil of several populations of Algerian Origanum glandulosum Desf.,
Flavour Fragr. J., 2006, 21, 6, 890-898, https://doi.org/10.1002/ffj.1738
. [all data]
Boustie, Rapior, et al., 2005
Boustie, J.; Rapior, S.; Fortin, H.; Tomas, S.; Bessiere, J.-M.,
Chemotaxonomic interest of volatile components in Lepista inversa and Lepista flaccida distinctions,
Cryptogamie, Mycologie, 2005, 26, 1, 1-4. [all data]
Chagonda and Chalchat, 2005
Chagonda, L.S.; Chalchat, J.-C.,
The essential oil of wild and cultivated Hoslundia opposita Vahl. from Zimbabwe,
Flavour Fragr. J., 2005, 20, 2, 193-195, https://doi.org/10.1002/ffj.1402
. [all data]
Fakhari, Salehi, et al., 2005
Fakhari, A.R.; Salehi, P.; Heydari, R.; Ebrahimi, S.N.; Haddad, P.R.,
Hydrodistillation-headspace solvent microextraction, a new method for analysis of the essential oil components of Lavandula angustifolia Mill.,
J. Chromatogr. A, 2005, 1098, 1-2, 14-18, https://doi.org/10.1016/j.chroma.2005.08.054
. [all data]
Jelén, Krawczyk, et al., 2005
Jelén, H.H.; Krawczyk, J.; Larsen, T.O.; Jarosz, A.; Golebniak, B.,
Main compounds responsible for off-odour of strawberries infected by Phytophthora cactorum,
Lett. Appl. Microbiol., 2005, 40, 4, 255-259, https://doi.org/10.1111/j.1472-765X.2005.01668.x
. [all data]
Morteza-Semnani, Akbarzadeh, et al., 2005
Morteza-Semnani, K.; Akbarzadeh, M.; Rostami, B.,
The essential oil composition of Teucrium chamaedrys L. from Iran,
Flavour Fragr. J., 2005, 20, 5, 544-546, https://doi.org/10.1002/ffj.1479
. [all data]
Sajjadi, 2005
Sajjadi, S.E.,
Analysis of the essential oil of Nepeta sintenisii Bornm. from Iran,
DARU, 2005, 13, 2, 61-64. [all data]
Singh, Raina, et al., 2005
Singh, A.K.; Raina, V.K.; Naqvi, A.A.; Patra, N.K.; Kumar, B.; Ram, P.; Khanuja, S.P.S.,
Essential oil composition and chemoarrays of menthol mint (Mentha arvensis L. f. piperascens Malinvaud ex. Holmes) cultivars,
Flavour Fragr. J., 2005, 20, 3, 302-305, https://doi.org/10.1002/ffj.1417
. [all data]
Skoula and Grayer, 2005
Skoula, M.; Grayer, R.J.,
Volatile oils of Coridothymus capitatus, Satureja thymbra, Satureja spinosa and Thymbra calostachya (Lamiaceae) from Crete,
Flavour Fragr. J., 2005, 20, 6, 573-576, https://doi.org/10.1002/ffj.1489
. [all data]
Tepe B., Sokmen M., et al., 2005
Tepe B.; Sokmen M.; Akpulat H.A.; Daferera D.; Polissiou M.; Sokmen A.,
Antioxidative activity of the essential oils of Thymus sipyleus subsp sipyleus var. sipyleus and Thymus sipyleus subsp sipyleus var. rosulans,
J. Food Eng., 2005, 66, 4, 447-454, https://doi.org/10.1016/j.jfoodeng.2004.04.015
. [all data]
Kalvandi, Sefidkon, et al., 2004
Kalvandi, R.; Sefidkon, F.; Atri, M.; Mirza, M.,
Analysis of the essential oil of Thymus eriocalyx from Iran,
Flavour Fragr. J., 2004, 19, 4, 341-343, https://doi.org/10.1002/ffj.1312
. [all data]
Ghannadi and Zolfaghari, 2003
Ghannadi, A.; Zolfaghari, B.,
Compositional analysis of the essential oil of Lallemantia royleana (Benth. in Wall.) Benth. from Iran,
Flavour Fragr. J., 2003, 18, 3, 237-239, https://doi.org/10.1002/ffj.1215
. [all data]
Pitarokili, Tzakou, et al., 2003
Pitarokili, D.; Tzakou, O.; Loukis, A.; Harvala, C.,
Volatile metabolites from Salvia fruticosa as antifungal agents in soilborne pathogens,
J. Agric. Food Chem., 2003, 51, 11, 3294-3301, https://doi.org/10.1021/jf0211534
. [all data]
Velickovic, Randjelovic, et al., 2003
Velickovic, D.T.; Randjelovic, N.V.; Ristic, M.S.; Velickovic, A.S.; Smelcerovic, A.A.,
Chemical constituents and antimicrobial activity of the ethanol extracts obtained from the flower, leaf, and stem of Salvia officinalis L.,
J. Serb. Chem. Soc., 2003, 68, 1, 17-24, https://doi.org/10.2298/JSC0301017V
. [all data]
Jirovetz, Smith, et al., 2002
Jirovetz, L.; Smith, D.; Buchbauer, G.,
Aroma compound analysis of Eruca sativa (Brassicaceae) SPME headspace leaf samples using GC, GC-MS, and olfactometry,
J. Agric. Food Chem., 2002, 50, 16, 4643-4646, https://doi.org/10.1021/jf020129n
. [all data]
Kobaisy, Tellez, et al., 2002
Kobaisy, M.; Tellez, M.R.; Dayan, F.E.; Duke, S.O.,
Phytotoxicity and volatile constituents from leaves of Callicarpa japonica Thunb.,
Phytochemistry, 2002, 61, 1, 37-40, https://doi.org/10.1016/S0031-9422(02)00207-8
. [all data]
Cornu, Carnat, et al., 2001
Cornu, A.; Carnat, A.-P.; Martin, B.; Coulon, J.-B.; Lamaison, J.-L.; Berdagué, J.-L.,
Solid-phase microextraction of volatile components from natural grassland plants,
J. Agric. Food Chem., 2001, 49, 1, 203-209, https://doi.org/10.1021/jf0008341
. [all data]
Maia, Zoghbi, et al., 2000
Maia, J.G.S.; Zoghbi, M.G.B.; Andrade, E.H.A.; da Silva, M.H.L.,
Essential oils from Conobea scoparioides (Cham. Schltdl.) Benth.,
Flavour Fragr. J., 2000, 15, 6, 413-414, https://doi.org/10.1002/1099-1026(200011/12)15:6<413::AID-FFJ931>3.0.CO;2-H
. [all data]
Mohagheghzadeh, Shams-Ardakani, et al., 2000
Mohagheghzadeh, A.; Shams-Ardakani, M.; Ghannadi, A.,
Linalol-rich essential oil of Zataria multiflora Boiss. (Lamiaceae),
Flavour Fragr. J., 2000, 15, 2, 119-122, https://doi.org/10.1002/(SICI)1099-1026(200003/04)15:2<119::AID-FFJ878>3.0.CO;2-V
. [all data]
Mohagheghzadeh, Shams-Ardakani, et al., 2000, 2
Mohagheghzadeh, A.; Shams-Ardakani, M.; Ghannadi, A.,
Volatile constituents of callus and flower-bearing tops of Zataria multiflora Boiss. (Lamiaceae),
Flavour Fragr. J., 2000, 15, 6, 373-376, https://doi.org/10.1002/1099-1026(200011/12)15:6<373::AID-FFJ923>3.0.CO;2-9
. [all data]
Tellez, Dayan, et al., 2000
Tellez, M.R.; Dayan, F.E.; Schrader, K.K.; Wedge, D.E.; Duke, S.O.,
Composition and some biological activities of the essential oils of Callicarpa Americana (L.),
J. Agric. Food Chem., 2000, 48, 7, 3008-3012, https://doi.org/10.1021/jf991026g
. [all data]
Shafiee, Javidnia, et al., 1999
Shafiee, A.; Javidnia, K.; Tabatabai, M.,
Volatile constituents and antimicrobial activity of zataria multiflora, population Iran,
Iran J. Chem. Chem. Eng., 1999, 18, 1, 1-5. [all data]
Rapior, Breheret, et al., 1997
Rapior, S.; Breheret, S.; Talou, T.; Bessiére, J.-M.,
Volatile flavor constituents of fresh Marasmius alliaceus (garlic Marasmius),
J. Agric. Food Chem., 1997, 45, 3, 820-825, https://doi.org/10.1021/jf960511y
. [all data]
Larsen and Frisvad, 1995
Larsen, T.O.; Frisvad, J.C.,
Characterization of volatile metabolites from 47 Penicillium taxa,
Mycol. Res., 1995, 99, 10, 1153-1166, https://doi.org/10.1016/S0953-7562(09)80271-2
. [all data]
Larsen and Frisvad, 1995, 2
Larsen, T.O.; Frisvad, J.C.,
Comparison of different methods for collection of volatile chemical markers from fungi,
J. Microbiol. Methods, 1995, 24, 2, 135-144, https://doi.org/10.1016/0167-7012(95)00063-1
. [all data]
Bravo and Hotchkiss, 1993
Bravo, A.; Hotchkiss, J.H.,
Identification of volatile compounds resulting from the thermal oxidation of polyethylene,
J. Appl. Polym. Sci., 1993, 47, 10, 1741-1748, https://doi.org/10.1002/app.1993.070471004
. [all data]
Macku and Shibamoto, 1991
Macku, C.; Shibamoto, T.,
Headspace volatile compounds formed from heated corn oil and corn oil with glycine,
J. Agric. Food Chem., 1991, 39, 7, 1265-1269, https://doi.org/10.1021/jf00007a014
. [all data]
Tamura, Kihara, et al., 1990
Tamura, H.; Kihara, S.; Sugisawa, H.,
A New Identification Method for Aliphatic Compounds Using Linear Equation of the GC Retention Index Value,
Agric. Biol. Chem., 1990, 54, 12, 3171-3176, https://doi.org/10.1271/bbb1961.54.3171
. [all data]
Binder and Flath, 1989
Binder, R.G.; Flath, R.A.,
Volatile components of pineapple guava,
J. Agric. Food Chem., 1989, 37, 3, 734-736, https://doi.org/10.1021/jf00087a034
. [all data]
de Pooter, Nicolai, et al., 1988
de Pooter, H.L.; Nicolai, B.; De Laet, J.; De Buyck, L.F.; Schamp, N.M.; Goetghebeur, P.,
The Essential Oils of Five Nepeta Species. A Preliminary Evaluation of their Use in Chemotaxonomy by Cluster Analysis,
Flavour Fragr. J., 1988, 3, 4, 155-159, https://doi.org/10.1002/ffj.2730030404
. [all data]
del Rosario, de Lumen, et al., 1984
del Rosario, R.; de Lumen, B.O.; Habu, T.; Flath, R.A.; Mon, T.R.; Teranishi, R.,
Comparison of headspace volatiles from winged beans and soybeans,
J. Agric. Food Chem., 1984, 32, 5, 1011-1015, https://doi.org/10.1021/jf00125a015
. [all data]
Fang, Pu, et al., 2012
Fang, S.; Pu, B.; Chen, A.; Kangzhou, Ao; Xu, D.,
A box-behnken design for characterizing Chineser truffles (Tuber indicum) aroma by HS-SPME-GC-MS,
J. Food Res., 2012, 1, 3, 219-229, https://doi.org/10.5539/jfr.v1n3p219
. [all data]
Robinson, Adams, et al., 2012
Robinson, A.L.; Adams, D.O.; Boss, P.K.; Heymann, H.; Solomon, P.S.; Trengove, R.D.,
Influence of geographic origine on the sensory characteristics and wine composition of Vitus viniferas cv. Cabernet Sauvignon wines from Australia (Supplemental data),
Am. J. Enol. Vitic., 2012, 64, 4, 467-476, https://doi.org/10.5344/ajev.2012.12023
. [all data]
Citron, Riclea, et al., 2011
Citron, C.A.; Riclea, R.; Brock, N.L.; Dickschat, J.S.,
Biosynthesis of acorane sesquiterpenes by Trichoderma. Electronic supplemental materials (ESI),
Royal Soc. Chem., 2011, 1-10. [all data]
Courtois, Paine, et al., 2009
Courtois, E.A.; Paine, C.E.; Blandinieres, P.-A.; Stien, D.; Bessiere, J.-M.; Houel, E.; Baraloto, C.; Chave, J.,
Diversity of the volatile organic compounds emitted by 55 species of tropical trees: a survey in French Guiana,
J. Chem. Ecol., 2009, 35, 11, 1349-1362, https://doi.org/10.1007/s10886-009-9718-1
. [all data]
Maggi, Bilek, et al., 2009
Maggi, F.; Bilek, T.; Lucarini, D.; Papa, F.; Sagratini, G.; Vittori, S.,
Melittis melissophyllum L. subsp. melissophylum (Lamiaceae) from central Italy: A new source of a mushrrom-like flavour,
Food Chem., 2009, 113, 1, 216-221, https://doi.org/10.1016/j.foodchem.2008.07.066
. [all data]
Barra, Baldovini, et al., 2007
Barra, A.; Baldovini, N.; Loiseau, A.-M.; Albino, L.; Lesecq, C.; Cuvelier, L.L.,
Chemical analysis of French beans (Phaseolus vulgaris L.) by headspace solid phase microextraction (HS-SPME) and simultaneous distillation/extraction (SDE),
Food Chem., 2007, 101, 3, 1279-1284, https://doi.org/10.1016/j.foodchem.2005.12.027
. [all data]
Chen and Feng, 2007
Chen, Y.; Feng, C.,
QSPR study on gas chromatography retention index of some organic pollutants,
Comput. Appl. Chem. (China), 2007, 24, 10, 1404-1408. [all data]
Feng and Mu, 2007
Feng, H.; Mu, L.-L.,
Quantitative structure-retention relationships for alkane and its derivatives based on electrotopological state index and molecular shape index,
Chem. Ind. Engineering (Chinese), 2007, 24, 2, 161-168. [all data]
Merle, Verdeguer, et al., 2007
Merle, H.; Verdeguer, M.; Blázquez, M.A.; Boira, H.,
Chemical composition of the essential oils from Eriocephalus africanus L. var. africanus populations growing in Spain,
Flavour Fragr. J., 2007, 22, 6, 461-464, https://doi.org/10.1002/ffj.1821
. [all data]
Mockute, Bernotiene, et al., 2007
Mockute, D.; Bernotiene, G.; Judzentiene, A.,
The essential oil of Ground Ivy (Glechoma hederaceae L.) growing wild in Eastern Lithuania,
J. Essent. Oil Res., 2007, 19, 5, 449-451, https://doi.org/10.1080/10412905.2007.9699948
. [all data]
Splivallo, Bossi, et al., 2007
Splivallo, R.; Bossi, S.; Maffei, M.; Bonfante, P.,
Discrimination of truffle fruiting body versus mycelial aromas by stir bar sorptive extraction,
Phytochemistry, 2007, 68, 20, 2584-2598, https://doi.org/10.1016/j.phytochem.2007.03.030
. [all data]
Chemat, Lucchesi, et al., 2006
Chemat, F.; Lucchesi, M.E.; Smadja, J.; Favretto, L.; Colnaghi, G.; Visinoni, F.,
Microwave accelerated steam distillation of essential oil from lavender: A rapid, clean and environmentally friendly approach,
Anal. Chim. Acta., 2006, 555, 1, 157-160, https://doi.org/10.1016/j.aca.2005.08.071
. [all data]
Iriti, Colnaghi, et al., 2006
Iriti, M.; Colnaghi, G.; Chemat, F.; Smadja, J.; Faoro, F.; Visinoni, F.A.,
Histo-cytochemistry and scanning electron microscopy of lavender glandular trichomes following conventional and microwave-assisted hydrodistillation of essential oils: a comparative study,
Flavour Fragr. J., 2006, 21, 4, 704-712, https://doi.org/10.1002/ffj.1692
. [all data]
Tognolini, Barocelli, et al., 2006
Tognolini, M.; Barocelli, E.; Ballabeni, V.; Bruni, R.; Bianchi, A.; Chiavarini, M.; Impicciatore, M.,
Comparative screening of plant essential oils: Phenylpropanoid moiety as basic core for antiplatelet activity,
Life Sciences, 2006, 78, 13, 1419-1432, https://doi.org/10.1016/j.lfs.2005.07.020
. [all data]
Belhattab, Larous, et al., 2005
Belhattab, R.; Larous, L.; Figueiredo, A.C.; Santos, P.A.G.; Barroso, J.G.; Pedro, L.G.,
Origanum glandulosum Desf. grown wild in Algeria: essential oil composition and glycosidic bound volatiles,
Flavour Fragr. J., 2005, 20, 2, 209-212, https://doi.org/10.1002/ffj.1387
. [all data]
Figueiredo, Sim-Sim, et al., 2005
Figueiredo, A.C.; Sim-Sim, M.; Costa, M.M.; Barroso, J.G.; Pedro, L.G.; Esquível, M.G.; Gutierres, F.; Lobo, C.; Fontinha, S.,
Comparison of the essential oil composition of four Plagiochila species: P. bifaria, P. maderensis, P. retrorsa and P. stricta,
Flavour Fragr. J., 2005, 20, 6, 703-709, https://doi.org/10.1002/ffj.1627
. [all data]
Jelen and Grabarkiewicz-Szczesna, 2005
Jelen, H.H.; Grabarkiewicz-Szczesna, J.,
Volatile compounds of Aspergillus strains with different abilities to produce ochratoxin A,
J. Agric. Food Chem., 2005, 53, 5, 1678-1683, https://doi.org/10.1021/jf0487396
. [all data]
Pino, Marbot, et al., 2005
Pino, J.A.; Marbot, R.; Rosado, A.; Vázquez, C.,
Volatile constituents of Malay rose apple [Syzygium malaccense (L.) Merr. Perry],
Flavour Fragr. J., 2005, 20, 98-100. [all data]
Garcia-Estaban, Ansorena, et al., 2004
Garcia-Estaban, M.; Ansorena, D.; Astiasaran, I.; Martin, D.; Ruiz, J.,
Comparison of simultaneous distillation extraction (SDE) and solid-phase microextraction (SPME) for the analysis of volatile compounds in dry-cured ham,
J. Sci. Food Agric., 2004, 84, 11, 1364-1370, https://doi.org/10.1002/jsfa.1826
. [all data]
Garcia-Estaban, Ansorena, et al., 2004, 2
Garcia-Estaban, M.; Ansorena, D.; Astiasarán, I.; Ruiz, J.,
Study of the effect of different fiber coatings and extraction conditions on dry cured ham volatile compounds extracted by solid-phase microextraction (SPME),
Talanta, 2004, 64, 2, 458-466, https://doi.org/10.1016/j.talanta.2004.03.007
. [all data]
Junkes, Amboni, et al., 2004
Junkes, B.S.; Amboni, R.D.M.C.; Yunes, R.A.; Heinzen, V.E.F.,
Application of the semi-empirical topological index in quantitative structure-chromatographic retention relationship (QSRR) studies of aliphatic ketones and aldehydes on stationary phases of different polarity,
J. Braz. Chem. Soc., 2004, 15, 2, 183-189, https://doi.org/10.1590/S0103-50532004000200005
. [all data]
Sahin, Gulluce, et al., 2004
Sahin, F.; Gulluce, M.; Daferera, D.; Sokmen, A.; Sokmen, M.; Polissiou, M.; Agar, G.; Ozer, H.,
Biological activities of the essential oils and methanol extract of Origanum vulgare ssp. vulgare in the Eastern Anatolia region of Turkey,
Food Control, 2004, 15, 7, 549-557, https://doi.org/10.1016/j.foodcont.2003.08.009
. [all data]
Vinogradov, 2004
Vinogradov, B.A.,
Production, composition, properties and application of essential oils, 2004, retrieved from http://viness.narod.ru. [all data]
Begnaud, Pérès, et al., 2003
Begnaud, F.; Pérès, C.; Berdagué, J.-L.,
Characterization of volatile effluents of livestock buildings by solid-phase microextraction,
Int. J. Environ. Anal. Chem., 2003, 83, 10, 837-849, https://doi.org/10.1080/03067310310001603349
. [all data]
Junkes, Castanho, et al., 2003
Junkes, B.S.; Castanho, R.D.M.; Amboni, C.; Yunes, R.A.; Heinzen, V.E.F.,
Semiempirical Topological Index: A Novel Molecular Descriptor for Quantitative Structure-Retention Relationship Studies,
Internet Electronic Journal of Molecular Design, 2003, 2, 1, 33-49. [all data]
Usai, Atzei, et al., 2003
Usai, M.; Atzei, A.; Pintore, G.; Casanova, I.,
Composition and variability of the essential oil of Sardinian Thymus herba-barona Loisel,
Flavour Fragr. J., 2003, 18, 1, 21-25, https://doi.org/10.1002/ffj.1137
. [all data]
Nogueira and Romano, 2002
Nogueira, J.M.F.; Romano, A.,
Essential oils from micropropagated plants of Lavandula viridis,
Phytochem. Anal., 2002, 13, 1, 4-7, https://doi.org/10.1002/pca.609
. [all data]
Rapior, Breheret, et al., 2002
Rapior, S.; Breheret, S.; Talou T.; Pelissier, Y.; Bessiere, J.-M.,
The anise-like odor of Clitocybe odora, Lentinellus cochleatus and Agaricus essettei,
Mycologia, 2002, 94, 3, 373-376, https://doi.org/10.2307/3761770
. [all data]
Spanier, Shahidi, et al., 2001
Spanier, A.M.; Shahidi, F.; Par; iment, T.H.; Mussinan, C.,
Food Flavors and Chemistry. Advances of the New Millenium, Royal Soc. Chem., 2001, 666. [all data]
Tirillini, Verdelli, et al., 2000
Tirillini, B.; Verdelli, G.; Paolocci, F.; Ciccioli, P.; Frattoni, M.,
The volatile organic compounds from the mycelium of Tuber borchii Vitt.,
Phytochemistry, 2000, 55, 8, 983-985, https://doi.org/10.1016/S0031-9422(00)00308-3
. [all data]
Estrada and Gutierrez, 1999
Estrada, E.; Gutierrez, Y.,
Modeling chromatographic parameters by a novel graph theoretical sub-structural approach,
J. Chromatogr. A, 1999, 858, 2, 187-199, https://doi.org/10.1016/S0021-9673(99)00808-0
. [all data]
Yusuf, Begum, et al., 1998
Yusuf, M.; Begum, J.; Mondello, L.; Stagno d'Alcontres, I.S.,
Studies on the essential oil bearing plants of Bangladesh. Part VI. Composition of the oil of Ocimum gratissimum L.,
Flavour Fragr. J., 1998, 13, 3, 163-166, https://doi.org/10.1002/(SICI)1099-1026(199805/06)13:3<163::AID-FFJ714>3.0.CO;2-1
. [all data]
Flanagan, Streete, et al., 1997
Flanagan, R.J.; Streete, P.J.; Ramsey, J.D.,
Volatile Substance Abuse, UNODC Technical Series, No 5, United Nations, Office on Drugs and Crime, Vienna International Centre, PO Box 500, A-1400 Vienna, Austria, 1997, 56, retrieved from http://www.odccp.org/pdf/technicalseries1997-01-011.pdf. [all data]
Jean, Garneau, et al., 1993
Jean, F.-I.; Garneau, F.-X.; Collin, G.J.; Bouhajib, M.; Zamir, L.O.,
The essential oil and glycosidically bound volatile compounds of Taxus canadensis marsh,
J. Essent. Oil Res., 1993, 5, 1, 7-11, https://doi.org/10.1080/10412905.1993.9698163
. [all data]
Storer, Elmore, et al., 1993
Storer, J.R.; Elmore, J.S.; van Emden, H.F.,
Airborne volatiles from the foliage of three cultivars of autumn flowering chrysanthemums,
Phytochemistry, 1993, 34, 6, 1489-1492, https://doi.org/10.1016/S0031-9422(00)90833-1
. [all data]
Strete, Ruprah, et al., 1992
Strete, P.J.; Ruprah, M.; Ramsey, J.D.; Flanagan, R.J.,
Detection and identification of volatile substances by headspace capillary gas chromatography to aid the diagnosis of acute poisoning,
Analyst, 1992, 117, 7, 1111-1127, https://doi.org/10.1039/an9921701111
. [all data]
Takeoka, Flath, et al., 1988
Takeoka, G.R.; Flath, R.A.; Güntert, M.; Jennings, W.,
Nectarine volatiles: vacuum steam distillation versus headspace sampling,
J. Agric. Food Chem., 1988, 36, 3, 553-560, https://doi.org/10.1021/jf00081a037
. [all data]
Kiss, Csoka, et al., 2011
Kiss, M.; Csoka, M.; Gyorfi, J.; Korany, K.,
Comparison of the fragrance constituents of Tuber aestivium and Tuber Brumale gathered in Hungary,
J. Appl. Botany Food Quality, 2011, 84, 102-110. [all data]
Karlsson, Birgersson, et al., 2009
Karlsson, M.F.; Birgersson, G.; Prado, A.M.C.; Bosa, F.; Bengtsson, M.; Witzgall, P.,
Plant Odor Analysis of Potato: Responce of Guatemalan Moth to Above- and Background Potato Volatiles,
J. Agric. Food Chem., 2009, 57, 13, 5903-5909, https://doi.org/10.1021/jf803730h
. [all data]
Mo, Fan, et al., 2009
Mo, X.; Fan, W.; Xu, Y.,
Changes in volatile compounds of Chinese rice wine wheat qu during fermentation and storage,
J. of the Institute of Brewing, 2009, 115, 4, 300-307, https://doi.org/10.1002/j.2050-0416.2009.tb00385.x
. [all data]
Zawirska-Wojtasiak, Siwulski, et al., 2009
Zawirska-Wojtasiak, R.; Siwulski, M.; Mildner-Szkudlarz, S.; Wasowicz, E.,
Studies of the aroma of different species and strains of Pleurotus measured by GC-MS, sensory analysis and electronic nose,
Acta Sci. Pol. Technol. Aliment., 2009, 8, 1, 47-61. [all data]
Beck, Higbee, et al., 2008
Beck, J.J.; Higbee, B.S.; Marrill, G.B.; Roitman, J.N.,
Comparison of volatile emissions from undamaged and mechanically damaged almonds,
J, Sci. Food Argic., 2008, 88, 8, 1363-1368, https://doi.org/10.1002/jsfa.3224
. [all data]
Kumazawa, Itobe, et al., 2008
Kumazawa, K.; Itobe, T.; Nishimura, O.; Hamaguchi, T.,
A new approach to estimate the in-mouth release characteristics of odorants in chewing gum,
Food Science and Technology Research, 2008, 14, 3, 269-276, https://doi.org/10.3136/fstr.14.269
. [all data]
Chen, Chyau, et al., 2007
Chen, C.-C.; Chyau, C.-C.; Hseu, TY.-H.,
Production of a COX-2 inhibitor, 2,4,5-trimethoxybenzaldehyde, with submerged cultured Antrodia camphorata,
Lett. Appl. Microbiol., 2007, 44, 4, 387-392, https://doi.org/10.1111/j.1472-765X.2006.02087.x
. [all data]
Cros, Vandanjon, et al., 2007
Cros, S.; Vandanjon, L.; Jaouen, P.; Bourseau, P.,
Processing of Industrial Mussel Cooking Juices by Reverse Osmotis: Pollution Abatement and Aromas Recovery, 2007, retrieved from title of Internet file: [imstec064]. [all data]
Nebesny, Budryn, et al., 2007
Nebesny, E.; Budryn, G.; Kula, J.; Majda, T.,
The effect of roasting method on headspace composition of robusta coffee bean aroma,
Eur. Food Res. Technol., 2007, 225, 1, 9-19, https://doi.org/10.1007/s00217-006-0375-0
. [all data]
Povolo, Contarini, et al., 2007
Povolo, M.; Contarini, G.; Mele, M.; Secchiari, P.,
Study on the influence of pasture on volatile fraction of Ewes' dairy products by solid-phase microextraction and gas chromatography-mass spectrometry,
J. Dairy Sci., 2007, 90, 2, 556-569, https://doi.org/10.3168/jds.S0022-0302(07)71539-4
. [all data]
Lee, Umano, et al., 2005
Lee, S.-J.; Umano, K.; Shibamoto, T.; Lee, K.-G.,
Identification of volatile components in basil (Ocimum basilicum L.) and thyme leaves (Thymus vulgaris L.) and their antioxidant properties,
Food Chem., 2005, 91, 1, 131-137, https://doi.org/10.1016/j.foodchem.2004.05.056
. [all data]
Rochat and Chaintreau, 2005
Rochat, S.; Chaintreau, A.,
Carbonyl Odorants Contributing to the In-Oven Roast Beef Top Note,
J. Agric. Food Chem., 2005, 53, 24, 9578-9585, https://doi.org/10.1021/jf058089l
. [all data]
Wu, Krings, et al., 2005
Wu, S.; Krings, U.; Zorn, H.; Berger, R.G.,
Volatile compounds from the fruiting bodies of beefsteak fungus Fistulina hepatica (Schaeffer: Fr.) Fr.,
Food Chem., 2005, 92, 2, 221-226, https://doi.org/10.1016/j.foodchem.2004.07.013
. [all data]
Cros, Vandanjon, et al., 2003, 2
Cros, S.; Vandanjon, L.; Jaouen, P.; Bourseau, P.,
IMSTEC'03 Conference Proceedings, Processing of industrial mussel cooking juices by reverse osmosis: pollution abatement and aromas recovery, Universoty of New South Wales, Sydney, Australia, 2003, 6. [all data]
Tanaka, Yamauchi, et al., 2003
Tanaka, T.; Yamauchi, T.; Katsumata, R.; Kiuchi, K.,
Comparison of volatile components in commercial Itohiki-Natto by solid phase microextraction and gas chromatography,
Nippon Shokuhin Kagaku Kogaku Kaishi, 2003, 50, 6, 278-285, https://doi.org/10.3136/nskkk.50.278
. [all data]
Galindo-Cuspinera, Lubran, et al., 2002
Galindo-Cuspinera, V.; Lubran, M.B.; Rankin, S.A.,
Comparison of volatile compounds in water- and oil-soluble annatto (Bixa orellana L.) extracts,
J. Agric. Food Chem., 2002, 50, 7, 2010-2015, https://doi.org/10.1021/jf011325h
. [all data]
Duque, Bonilla, et al., 2001
Duque, C.; Bonilla, A.; Bautista, E.; Zea, S.,
Exudation of low molecular wight compounds (thiobismethane, methyl isocyanide, amd methyl isothiocyanate) as a possible chemical defense mechanism in the marine sponge Ircinia felix,
Biochem. Systematics Ecol., 2001, 29, 5, 459-467, https://doi.org/10.1016/S0305-1978(00)00081-8
. [all data]
Korány, Mednyánszky, et al., 2000
Korány, K.; Mednyánszky, Zs.; Amtmann, M.,
Preliminary results of a recognition method visualizing the aroma and fragrance features,
Acta Aliment., 2000, 29, 2, 187-198, https://doi.org/10.1556/AAlim.29.2000.2.9
. [all data]
Umano, Hagi, et al., 2000
Umano, K.; Hagi, Y.; Nakahara, K.; Shoji, A.; Shibamoto, T.,
Volatile chemicals identified in extracts from leaves of Japanese mugwort (Artemisia princeps Pamp.),
J. Agric. Food Chem., 2000, 48, 8, 3463-3469, https://doi.org/10.1021/jf0001738
. [all data]
Hirose, Joichi, et al., 1999
Hirose, S.; Joichi, A.; Nakamura, S.; Awano, K.,
Volatile components of musky scent of orchids,
Flavour Fragr. J., 1999, 14, 3, 183-184, https://doi.org/10.1002/(SICI)1099-1026(199905/06)14:3<183::AID-FFJ804>3.0.CO;2-S
. [all data]
Ngassoum, Yonkeu, et al., 1999
Ngassoum, M.B.; Yonkeu, S.; Jirovetz, L.; Buchbauer, G.; Schmaus, G.; Hammerschmidt, F.-J.H.,
Chemical composition of essential oils of Lantana camara leaves and flowers from Cameroon and Madagascar,
Flavour Fragr. J., 1999, 14, 4, 245-250, https://doi.org/10.1002/(SICI)1099-1026(199907/08)14:4<245::AID-FFJ819>3.0.CO;2-X
. [all data]
Shuichi, Masazumi, et al., 1996
Shuichi, H.; Masazumi, N.; Hiromu, K.; Kiyoshi, F.,
Comparison of volatile compounds berween the crude drugs, Onji-tsutsu and Onji-niki,
Nippon nogei kagaku kaishi, 1996, 70, 2, 151-160. [all data]
Kawakami and Kobayashi, 1991
Kawakami, M.; Kobayashi, A.,
Volatitle constituents of greem mate and roasted mate,
J. Agric. Food Chem., 1991, 39, 7, 1275-1279, https://doi.org/10.1021/jf00007a016
. [all data]
Seifert and King, 1982
Seifert, R.M.; King, A.D., Jr.,
Identification of some volatile constituents of Aspergillus clavatus,
J. Agric. Food Chem., 1982, 30, 4, 786-790, https://doi.org/10.1021/jf00112a044
. [all data]
Buttery and Kamm, 1980
Buttery, R.G.; Kamm, J.A.,
Volatile components of alfalfa: possible insect host plant attractants,
J. Agric. Food Chem., 1980, 28, 5, 978-981, https://doi.org/10.1021/jf60231a014
. [all data]
Vekiari, Orepoulou, et al., 2010
Vekiari, S.A.; Orepoulou, V.; Kourkoutas, Y.; Kamoun, N.; Msallem, M.; Psimouli, V.; Arapoglou, D.,
Characterization and seasonal variations of the quality of virgin olive oil of the Thoumbolia and Koroneiki varieties from Southern Greece,
Grasas y Aceites, 2010, 61, 3, 221-231, https://doi.org/10.3989/gya.108709
. [all data]
Canuti, Conversano, et al., 2009
Canuti, V.; Conversano, M.; Li Calzi, M.; Heymann, H.; Matthews, M.A.; Ebeler, S.E.,
Headspace solid-phase microextraction - gas chromatography - mass spectrometry for profiling free volatile compounds in Cabernet Sauvignon grapes and vines,
J. Chromatogr. A., 2009, 1216, 15, 3012-3022, https://doi.org/10.1016/j.chroma.2009.01.104
. [all data]
Yongsheng, Hua, et al., 2008
Yongsheng, T.; Hua, L.; Hua, W.; Li, Z.,
Volatile composition of young Cabernet Savignon red wine from Changli Counti (China),
J. Food Composition and Analysis, 2008, 21, 8, 689-694, https://doi.org/10.1016/j.jfca.2008.05.007
. [all data]
Pontes, Marques, et al., 2007
Pontes, M.; Marques, J.C.; Camara, J.S.,
Screening of volatile composition from Portuguese multifloral honeys using headspace solid-phase microextraction-gas chromatography-quadrupole mass spectrometry,
Talanta, 2007, 74, 1, 91-103, https://doi.org/10.1016/j.talanta.2007.05.037
. [all data]
Kim. J.H., Ahn, et al., 2004
Kim. J.H.; Ahn, H.J.; Yook, H.S.; Kim, K.S.; Rhee, M.S.; Ryu, G.H.; Byun, M.W.,
Color, flavor, and sensory characteristics of gamma-irradiated salted and fermented anchovy sauce,
Radiation Phys. Chem., 2004, 69, 2, 179-187, https://doi.org/10.1016/S0969-806X(03)00400-6
. [all data]
le Pape, Grua-Priol, et al., 2004
le Pape, M.-A.; Grua-Priol, J.; Prost, C.; Demaimay, M.,
Optimization of dynamic headspace extraction of the edible red algae Palmaria palmata and identification of the volatile components,
J. Agric. Food Chem., 2004, 52, 3, 550-556, https://doi.org/10.1021/jf030478x
. [all data]
Piveteau, le Guen, et al., 2000
Piveteau, F.; le Guen, S.; Gandemer, G.; Baud, J.-P.; Demaimay, M.,
Aroma of fresh oysters Crassostrea gigas: composition and aroma notes,
J. Agric. Food Chem., 2000, 48, 10, 4851-4857, https://doi.org/10.1021/jf991394k
. [all data]
Caldentey, Daria Fumi, et al., 1998
Caldentey, P.; Daria Fumi, M.; Mazzoleni, V.; Careri, M.,
Volatile compounds produced by microorganisms isolated from cork,
Flavour Fragr. J., 1998, 13, 3, 185-188, https://doi.org/10.1002/(SICI)1099-1026(199805/06)13:3<185::AID-FFJ723>3.0.CO;2-W
. [all data]
Jakobsen, Hansen, et al., 1998
Jakobsen, H.B.; Hansen, M.; Christensen, M.R.; Brockhoff, P.B.; Olsen, C.E.,
Aroma volatiles of blanched green peas (Pisum sativum L.),
J. Agric. Food Chem., 1998, 46, 9, 3727-3734, https://doi.org/10.1021/jf980026y
. [all data]
Castioni and Kapetanidis, 1996
Castioni, P.; Kapetanidis, I.,
Volatile constituents from Brunfelsia grandiflora ssp. grandiflora: qualitative analysis by GC-MS,
Scientia Pharmaceutica, 1996, 64, 83-91. [all data]
Luning, de Rijk, et al., 1994
Luning, P.A.; de Rijk, T.; Wichers, H.J.; Roozen, J.P.,
Gas chromatography, mass spectrometry, and sniffing port analyses of volatile compounds of fresh bell peppers (Capsicum annuum) at different ripening stages,
J. Agric. Food Chem., 1994, 42, 4, 977-983, https://doi.org/10.1021/jf00040a027
. [all data]
Peng, Yang, et al., 1991
Peng, C.T.; Yang, Z.C.; Ding, S.F.,
Prediction of rentention idexes. II. Structure-retention index relationship on polar columns,
J. Chromatogr., 1991, 586, 1, 85-112, https://doi.org/10.1016/0021-9673(91)80028-F
. [all data]