Amidosulfenyl fluoride,cyanofluoro-
- Formula: CF2N2S
- Molecular weight: 110.086
- IUPAC Standard InChIKey: UEBYJSZIEUOOCX-UHFFFAOYSA-N
- CAS Registry Number: 106661-59-0
- Chemical structure:
View 3d structure (requires JavaScript / HTML 5) - Permanent link for this species. Use this link for bookmarking this species for future reference.

Gas phase ion energetics data

Data compiled by: Henry M. Rosenstock, Keith Draxl, Bruce W. Steiner, and John T. Herron
Appearance energy determinations
Ion | AE (eV) | Other Products | Method | Reference | Comment |
---|---|---|---|---|---|
F2S+ | 12.1 ± 0.1 | ? | EI | Glemser, Muller, et al., 1968 |

References

Glemser, Muller, et al., 1968
Glemser, O.; Muller, A.; Bohler, D.; Krebs, B.,
Die N-S-Bindung: Bindungslangen Kraftkonstanten, Bindungsgrade und Bindungsenergien,
Z. Anorg. Allgem. Chem., 1968, 357, 184. [all data]