Stannane, chlorotrimethyl-
- Formula: C3H9ClSn
- Molecular weight: 199.267
- IUPAC Standard InChIKey: KWTSZCJMWHGPOS-UHFFFAOYSA-M
- CAS Registry Number: 1066-45-1
- Chemical structure:
View 3d structure (requires JavaScript / HTML 5) - Other names: Chlorotrimethylstannane; Chlorotrimethyltin; M&T Chemicals 1222-45; Trimethylchlorostannane; Trimethylchlorotin; Trimethylstannyl chloride; Trimethyltin chloride; (CH3)3SnCl; Stannylium, trimethyl-, chloride; Tin(+), trimethyl-, chloride; Trimethyltin monochloride; NSC 12088; NSC 92613

Gas phase thermochemistry data

Data compiled by: José A. Martinho Simões
Quantity | Value | Units | Method | Reference | Comment |
---|---|---|---|---|---|
ΔfH°gas | -195.4 | kJ/mol | Review | Martinho Simões | The enthalpy of formation relies on -379.8 ± 4.1 kJ/mol for the enthalpy of formation of Sn(Me)3(OH)(cr). |

Condensed phase thermochemistry data

Data compiled by: José A. Martinho Simões
Quantity | Value | Units | Method | Reference | Comment |
---|---|---|---|---|---|
ΔfH°liquid | -212.5 ± 7.1 | kJ/mol | Review | Martinho Simões | The enthalpy of formation relies on -49.7 ± 2.0 kJ/mol for the enthalpy of formation of Sn(Me)4(l). |
Quantity | Value | Units | Method | Reference | Comment |
ΔfH°solid | -245.6 ± 4.1 | kJ/mol | Review | Martinho Simões | The enthalpy of formation relies on -379.8 ± 4.1 kJ/mol for the enthalpy of formation of Sn(Me)3(OH)(cr). |

Phase change data

Data compiled by: José A. Martinho Simões
Quantity | Value | Units | Method | Reference | Comment |
---|---|---|---|---|---|
ΔsubH° | 50.2 | kJ/mol | RSC | Baldwin, Lappert, et al., 1972 |

Reaction thermochemistry data

Data compiled as indicated in comments:
MS - José A. Martinho Simões
B - John E. Bartmess
Individual Reactions
By formula: 3C4H12Sn (l) + Cl4Sn (l) = 4C3H9ClSn (l)
Quantity | Value | Units | Method | Reference | Comment |
---|---|---|---|---|---|
ΔrH° | -184. ± 28. | kJ/mol | RSC | Nash, Skinner, et al., 1965 | Please also see Pedley and Rylance, 1977 and Cox and Pilcher, 1970.; MS |
(cr) +
(l) = C3H10OSn (cr) + (
• 55
) (solution)
By formula: C3H9ClSn (cr) + H2O (l) = C3H10OSn (cr) + (HCl • 55H2O) (solution)
Quantity | Value | Units | Method | Reference | Comment |
---|---|---|---|---|---|
ΔrH° | -13.8 ± 0.4 | kJ/mol | RSC | Baldwin, Lappert, et al., 1972 | MS |
+
= C3H9Cl2Sn-
By formula: Cl- + C3H9ClSn = C3H9Cl2Sn-
Quantity | Value | Units | Method | Reference | Comment |
---|---|---|---|---|---|
ΔrH° | 131. ± 7.1 | kJ/mol | CIDT | Hao, Kaspar, et al., 2005 | gas phase; B |

Gas phase ion energetics data

Data compiled as indicated in comments:
LLK - Sharon G. Lias, Rhoda D. Levin, and Sherif A. Kafafi
Ionization energy determinations
IE (eV) | Method | Reference | Comment |
---|---|---|---|
9.90 | PE | Fragala, Ciliberto, et al., 1980 | LLK |
10.16 | PE | Flamini, Semprini, et al., 1976 | Vertical value; LLK |

Ion clustering data

Data compiled by: John E. Bartmess
Clustering reactions
+
= C3H9Cl2Sn-
By formula: Cl- + C3H9ClSn = C3H9Cl2Sn-
Quantity | Value | Units | Method | Reference | Comment |
---|---|---|---|---|---|
ΔrH° | 131. ± 7.1 | kJ/mol | CIDT | Hao, Kaspar, et al., 2005 | gas phase |

References

Martinho Simões
Martinho Simões, J.A.,
Private communication (see http://webbook.nist.gov/chemistry/om/). [all data]
Baldwin, Lappert, et al., 1972
Baldwin, J.C.; Lappert, M.F.; Pedley, J.B.; Poland, J.S.,
J. Chem. Soc., Dalton Trans., 1972, 1943.. [all data]
Nash, Skinner, et al., 1965
Nash, G.A.; Skinner, H.A.; Stack, W.F.,
Trans. Faraday Soc., 1965, 61, 640. [all data]
Pedley and Rylance, 1977
Pedley, J.B.; Rylance, J.,
Computer Analysed Thermochemical Data: Organic and Organometallic Compounds, University of Sussex, Brigton, 1977. [all data]
Cox and Pilcher, 1970
Cox, J.D.; Pilcher, G.,
Thermochemistry of Organic and Organometallic Compounds
in Academic Press, New York, 1970. [all data]
Hao, Kaspar, et al., 2005
Hao, C.T.; Kaspar, J.D.; Check, C.E.; Lobring, K.C.; Gilbert, T.M.; Sunderlin, L.S.,
Effect of substituents on the strength of A-Cl- (A = Si, Ge, and Sn) bonds in hypervalent systems: ACl(5)(-), ACl(4)F(-), and A(CH3)(3)Cl-2(-),
J. Phys. Chem. A, 2005, 109, 9, 2026-2034, https://doi.org/10.1021/jp040743x
. [all data]
Fragala, Ciliberto, et al., 1980
Fragala, I.; Ciliberto, E.; Egdell, R.G.; Granozzi, G.,
He(I) and He(II) photoelectron spectra of methyltin chlorides,
J. Chem. Soc. Dalton Trans., 1980, 145. [all data]
Flamini, Semprini, et al., 1976
Flamini, A.; Semprini, E.; Stefani, F.; Sorriso, S.; Cardaci, G.,
He(I) photoelectron spectra and semiempirical molecular-orbital calculations on methylmetal halides of group 4A elements,
J. Chem. Soc. Dalton Trans., 1976, 731. [all data]