1,4-Benzenediamine
- Formula: C6H8N2
- Molecular weight: 108.1411
- IUPAC Standard InChIKey: CBCKQZAAMUWICA-UHFFFAOYSA-N
- CAS Registry Number: 106-50-3
- Chemical structure:
View 3d structure (requires JavaScript / HTML 5) - Other names: p-Aminoaniline; p-Benzenediamine; p-Diaminobenzene; p-Phenylenediamine; Benzofur D; BASF Ursol D; C.I. Developer 13; C.I. Oxidation Base 10; C.I. 76060; Developer PF; Durafur Black R; Fouramine D; Fourrine D; Fourrine 1; Fur Black 41867; Fur Brown 41866; Fur Yellow; Furro D; Futramine D; Nako H; Orsin; Pelagol D; Pelagol DR; Pelagol Grey D; Peltol D; Renal PF; Santoflex LC; Tertral D; Ursol D; Zoba Black D; 1,4-Diaminobenzene; 1,4-Phenylenediamine; 4-Aminoaniline; Developer 13; Fenylenodwuamina; Oxidation base 10; Phenylenediamine, para; PARA; PPD; Santoflex IC; USAF EK-394; p-Fenylendiamin; Paraphenylen-diamine; Rodol D; UN 1673; Vulkanox 4020; Aminogen II; NSC 4777

Condensed phase thermochemistry data

Data compiled as indicated in comments:
ALS - Hussein Y. Afeefy, Joel F. Liebman, and Stephen E. Stein
DH - Eugene S. Domalski and Elizabeth D. Hearing
Quantity | Value | Units | Method | Reference | Comment |
---|---|---|---|---|---|
ΔfH°solid | 6.3 | kJ/mol | Ccb | Kunyavskaya, Karyakin, et al., 1973 | see Karyakin, Rabinovich, et al., 1978; ALS |
Quantity | Value | Units | Method | Reference | Comment |
ΔcH°solid | -3511. ± 3. | kJ/mol | Ccb | Kunyavskaya, Karyakin, et al., 1973 | see Karyakin, Rabinovich, et al., 1978; ALS |
ΔcH°solid | -3507.4 ± 0.63 | kJ/mol | Ccb | Kibler and Hunt, 1949 | Reanalyzed by Cox and Pilcher, 1970, Original value = -3506.9 ± 0.63 kJ/mol; ALS |
ΔcH°solid | -3509.3 ± 0.63 | kJ/mol | Ccb | Sullivan, Kibler, et al., 1948 | ALS |
Quantity | Value | Units | Method | Reference | Comment |
S°solid,1 bar | 149.70 | J/mol*K | N/A | Kunyavskaya, Karyakin, et al., 1973 | DH |
Constant pressure heat capacity of solid
Cp,solid (J/mol*K) | Temperature (K) | Reference | Comment |
---|---|---|---|
155.64 | 300. | Kunyavskaya, Karyakin, et al., 1973 | T = 20 to 300 K.; DH |

Phase change data

Data compiled as indicated in comments:
BS - Robert L. Brown and Stephen E. Stein
TRC - Thermodynamics Research Center, NIST Boulder Laboratories, Chris Muzny director
AC - William E. Acree, Jr., James S. Chickos
DH - Eugene S. Domalski and Elizabeth D. Hearing
Quantity | Value | Units | Method | Reference | Comment |
---|---|---|---|---|---|
Tboil | 540.2 | K | N/A | Weast and Grasselli, 1989 | BS |
Quantity | Value | Units | Method | Reference | Comment |
Tfus | 412.3 | K | N/A | Bret-Dibat and Lichanot, 1989 | Crystal phase 1 phase; Uncertainty assigned by TRC = 0.5 K; TRC |
Tfus | 415.7 | K | N/A | Rai and Mandal, 1989 | Uncertainty assigned by TRC = 0.1 K; TRC |
Tfus | 414.2 | K | N/A | Kemula, Buchowski, et al., 1968 | Uncertainty assigned by TRC = 0.2 K; TRC |
Tfus | 414.14 | K | N/A | Witschonke, 1954 | Uncertainty assigned by TRC = 0.3 K; TRC |
Tfus | 414.35 | K | N/A | Witschonke, 1954 | Uncertainty assigned by TRC = 0.2 K; TRC |
Quantity | Value | Units | Method | Reference | Comment |
ΔsubH° | 92.2 ± 0.2 | kJ/mol | C | Sabbah and Perez, 1997 | AC |
Enthalpy of fusion
ΔfusH (kJ/mol) | Temperature (K) | Reference | Comment |
---|---|---|---|
24.900 | 416. | Rai and Mandal, 1990 | Temperature from graph.; DH |
21.7 | 412.3 | Domalski and Hearing, 1996 | AC |
Entropy of fusion
ΔfusS (J/mol*K) | Temperature (K) | Reference | Comment |
---|---|---|---|
59.8 | 416. | Rai and Mandal, 1990 | Temperature; DH |

Gas phase ion energetics data

Data evaluated as indicated in comments:
HL - Edward P. Hunter and Sharon G. Lias
L - Sharon G. Lias
Data compiled as indicated in comments:
LLK - Sharon G. Lias, Rhoda D. Levin, and Sherif A. Kafafi
RDSH - Henry M. Rosenstock, Keith Draxl, Bruce W. Steiner, and John T. Herron
Quantity | Value | Units | Method | Reference | Comment |
---|---|---|---|---|---|
IE (evaluated) | 6.87 ± 0.05 | eV | N/A | N/A | L |
Quantity | Value | Units | Method | Reference | Comment |
Proton affinity (review) | 905.9 | kJ/mol | N/A | Hunter and Lias, 1998 | HL |
Quantity | Value | Units | Method | Reference | Comment |
Gas basicity | 874.0 | kJ/mol | N/A | Hunter and Lias, 1998 | HL |
Ionization energy determinations
IE (eV) | Method | Reference | Comment |
---|---|---|---|
6.84 | PE | Tsuji, Saito, et al., 1973 | LLK |
7.16 | EI | Johnstone and Mellon, 1973 | LLK |
6.89 ± 0.03 | PI | Potapov, Kardash, et al., 1972 | LLK |
7.0 ± 0.1 | CTS | Farrell and Newton, 1966 | RDSH |
7.58 | EI | Crable and Kearns, 1962 | RDSH |
7.15 | CTS | Briegleb and Czekalla, 1959 | RDSH |
7.34 | PE | Cabelli, Cowley, et al., 1981 | Vertical value; LLK |
7.61 | PE | Palmer, Moyes, et al., 1979 | Vertical value; LLK |
7.34 | PE | Streets, Hall, et al., 1972 | Vertical value; LLK |

Lee's RI, non-polar column, temperature ramp

View large format table.

Column type Active phase I Reference Comment
CapillaryDB-5MS212.86Chen, Keeran, et al., 200230. m/0.25 mm/0.5 μm, 40. C @ 1. min, 10. K/min; Tend: 310. C

References

Kunyavskaya, Karyakin, et al., 1973
Kunyavskaya, S.G.; Karyakin, N.V.; Krylova, G.P.; Chernova, V.I.; Rabinovich, I.B.,
Heat capacity and thermodynamic properties of iosmeric phenylenediamines,
Tr. Khim. Khim. Tekhnol., 1973, 58-59. [all data]
Karyakin, Rabinovich, et al., 1978
Karyakin, N.V.; Rabinovich, I.B.; Sokolov, L.B.,
Thermodynamics of the synthesis of isomeric poly(phenylenephthalamides),
Vysokomol. Soedin. Ser. B, 1978, 20, 662-666. [all data]
Kibler and Hunt, 1949
Kibler, G.M.; Hunt, H.,
Heats of combustion. V. The heats of combustion of five nitrogen-containing compounds,
J. Phys. Chem., 1949, 53, 955-956. [all data]
Cox and Pilcher, 1970
Cox, J.D.; Pilcher, G.,
Thermochemistry of Organic and Organometallic Compounds, Academic Press, New York, 1970, 1-636. [all data]
Sullivan, Kibler, et al., 1948
Sullivan, M.V.; Kibler, G.M.; Hunt, H.,
Heats of combustion of nitrogen containing compounds, Rpt. Tech. Memo. PUR-3 for USN Project SQUID Contract N6ori-104, Task Order No. 1 Designation No. NR 22 042 by Purdue University, Lafayette, IN, 1948, 1-46. [all data]
Weast and Grasselli, 1989
CRC Handbook of Data on Organic Compounds, 2nd Editon, Weast,R.C and Grasselli, J.G., ed(s)., CRC Press, Inc., Boca Raton, FL, 1989, 1. [all data]
Bret-Dibat and Lichanot, 1989
Bret-Dibat, P.; Lichanot, A.,
Proprietes thermodynamiques des isomeres de position de benzenes disubstitues en phase condensee,
Thermochim. Acta, 1989, 147, 2, 261, https://doi.org/10.1016/0040-6031(89)85181-0
. [all data]
Rai and Mandal, 1989
Rai, U.S.; Mandal, K.D.,
Chemistry of organic eutectics and 1:1 addition compound: p-phenylenediamine-catechol system,
Thermochim. Acta, 1989, 138, 219. [all data]
Kemula, Buchowski, et al., 1968
Kemula, W.; Buchowski, H.; Pawlowski, W.,
Effect of the position of substituents in an aromatic ring on R(f) and partition coefficients: II. aromatic amines,
Rocz. Chem., 1968, 42, 1951. [all data]
Witschonke, 1954
Witschonke, C.R.,
Freezing point and purity data for some organic compounds,
Anal. Chem., 1954, 26, 562-4. [all data]
Sabbah and Perez, 1997
Sabbah, Raphaël; Perez, Laurence,
Energétique des liaisons inter- et intramoléculaires dans les trois isomères du benzènediamine,
Can. J. Chem., 1997, 75, 4, 357-364, https://doi.org/10.1139/v97-041
. [all data]
Rai and Mandal, 1990
Rai, U.S.; Mandal, K.D.,
Chemistry of organic eutectics: p-phenylenediamine-m-nitrobenzoic acid system involving the 1:2 addition compound,
Bull. Chem. Soc. Jpn., 1990, 63(5), 1496-1502. [all data]
Domalski and Hearing, 1996
Domalski, Eugene S.; Hearing, Elizabeth D.,
Heat Capacities and Entropies of Organic Compounds in the Condensed Phase. Volume III,
J. Phys. Chem. Ref. Data, 1996, 25, 1, 1, https://doi.org/10.1063/1.555985
. [all data]
Hunter and Lias, 1998
Hunter, E.P.; Lias, S.G.,
Evaluated Gas Phase Basicities and Proton Affinities of Molecules: An Update,
J. Phys. Chem. Ref. Data, 1998, 27, 3, 413-656, https://doi.org/10.1063/1.556018
. [all data]
Tsuji, Saito, et al., 1973
Tsuji, K.; Saito, M.; Tani, T.,
Ionization potentials of phenylenediamines and steric effect in the ortho isomer,
Denki Kagaku oyobi Kogyo Butsuri Kagaku, 1973, 41, 688. [all data]
Johnstone and Mellon, 1973
Johnstone, R.A.W.; Mellon, F.A.,
Effects of induction and resonance in the calculation of ionization potentials of substituted benzenes by perturbation molecular orbital theory,
J. Chem. Soc. Faraday Trans. 2, 1973, 69, 36. [all data]
Potapov, Kardash, et al., 1972
Potapov, V.K.; Kardash, I.E.; Sorokin, V.V.; Sokolov, S.A.; Evlasheva, T.I.,
Photoionization of heteroaromatic compounds,
Khim. Vys. Energ., 1972, 6, 392. [all data]
Farrell and Newton, 1966
Farrell, P.G.; Newton, J.,
Ionization potentials of primary aromatic amines and aza-hydrocarbons,
Tetrahedron Lett., 1966, 5517. [all data]
Crable and Kearns, 1962
Crable, G.F.; Kearns, G.L.,
Effect of substituent groups on the ionization potentials of benzenes,
J. Phys. Chem., 1962, 66, 436. [all data]
Briegleb and Czekalla, 1959
Briegleb, G.; Czekalla, J.,
Die Bestimmung von lonisierungsenergien aus den Spektren von Elektronenubergangskomplexen,
Z.Elektrochem., 1959, 63, 6. [all data]
Cabelli, Cowley, et al., 1981
Cabelli, D.E.; Cowley, A.H.; Dewar, M.J.S.,
UPE studies of conjugation involving group 5A elements. 1. Phenylphosphines,
J. Am. Chem. Soc., 1981, 103, 3286. [all data]
Palmer, Moyes, et al., 1979
Palmer, M.H.; Moyes, W.; Spiers, M.; Ridyard, J.N.A.,
The electronic structure of substituted benzenes; a study of aniline, the toluidines, phenylenediamines and fluoroanilines by photoelectron spectroscopy and ab initio calculations,
J. Mol. Struct., 1979, 53, 235. [all data]
Streets, Hall, et al., 1972
Streets, D.G.; Hall, W.E.; Ceasar, G.P.,
Mesomeric mixing in the π energy levels of aminobenzenes studied by photoelectron spectroscopy,
Chem. Phys. Lett., 1972, 17, 90. [all data]