Benzene, 1,4-dichloro-
- Formula: C6H4Cl2
- Molecular weight: 147.002
- IUPAC Standard InChIKey: OCJBOOLMMGQPQU-UHFFFAOYSA-N
- CAS Registry Number: 106-46-7
- Chemical structure:
View 3d structure (requires JavaScript / HTML 5) - Isotopologues:
- Other names: Benzene, p-dichloro-; p-Chlorophenyl chloride; p-Dichlorobenzene; Di-chloricide; Evola; Paradi; Paradow; Paramoth; Persia-Perazol; PDB; Santochlor; 1,4-Dichlorobenzene; p-Dichlorobenzol; Paradichlorobenzol; para-Dichlorobenzene; p-Dichloorbenzeen; p-Dichlorbenzol; p-Diclorobenzene; Dichlorobenzene; Dichlorobenzene, p-; NCI-C54955; para crystals; Paracide; Paranuggets; Parazene; 1,4-Dichloorbenzeen; 1,4-Dichlor-benzol; 1,4-Diclorobenzene; Dichlorobenzene, para; Globol; Paradichlorbenzol; Rcra waste number U070; Rcra waste number U071; Rcra waste number U072; UN 1592; Dichlorocide; Kaydox; p-Dichlorbenzene; NSC 36935; 1,4-chlorobenzene

Gas phase thermochemistry data

Data compiled by: Hussein Y. Afeefy, Joel F. Liebman, and Stephen E. Stein
Quantity | Value | Units | Method | Reference | Comment |
---|---|---|---|---|---|
ΔfH°gas | 5.88 | kcal/mol | Ccr | Platonov and Simulin, 1984 |

Condensed phase thermochemistry data

Data compiled as indicated in comments:
ALS - Hussein Y. Afeefy, Joel F. Liebman, and Stephen E. Stein
DH - Eugene S. Domalski and Elizabeth D. Hearing
Quantity | Value | Units | Method | Reference | Comment |
---|---|---|---|---|---|
ΔcH°liquid | -702. ± 1. | kcal/mol | Ccb | Smith, Bjellerup, et al., 1953 | ALS |
Quantity | Value | Units | Method | Reference | Comment |
ΔfH°solid | -10.12 ± 0.25 | kcal/mol | Ccb | Hubbard, Knowlton, et al., 1954 | ALS |
Quantity | Value | Units | Method | Reference | Comment |
ΔcH°solid | -702.65 | kcal/mol | Ccr | Platonov and Simulin, 1984 | ALS |
ΔcH°solid | -701.27 ± 0.25 | kcal/mol | Ccb | Hubbard, Knowlton, et al., 1954 | ALS |
Quantity | Value | Units | Method | Reference | Comment |
S°solid,1 bar | 41.924 | cal/mol*K | N/A | Dworkin, Figuiere, et al., 1976 | crystaline, II phase; DH |
Constant pressure heat capacity of solid
Cp,solid (cal/mol*K) | Temperature (K) | Reference | Comment |
---|---|---|---|
23. | 180. | Martin and Monti, 1988 | T = 30 to 180 K. Data given graphically, and estimated from graph.; DH |
35.315 | 298.15 | Dworkin, Figuiere, et al., 1976 | crystaline, II phase; T = 20 to 330 K.; DH |
34.11 | 298.15 | Ueberreiter and Orthmann, 1950 | T = 293 to 368 K. Equation only.; DH |
41.11 | 299.8 | Andrews and Haworth, 1928 | T = 101 to 336 K. Value is unsmoothed experimental datum.; DH |
35.28 | 298. | Narbutt, 1918 | T = 194 to 372 K. Average specific heat over the temperature range 2.6 to 51.6 °C is 0.2400 cal/g*K.; DH |

Phase change data

Data compiled as indicated in comments:
BS - Robert L. Brown and Stephen E. Stein
TRC - Thermodynamics Research Center, NIST Boulder Laboratories, Chris Muzny director
AC - William E. Acree, Jr., James S. Chickos
ALS - Hussein Y. Afeefy, Joel F. Liebman, and Stephen E. Stein
DH - Eugene S. Domalski and Elizabeth D. Hearing
Quantity | Value | Units | Method | Reference | Comment |
---|---|---|---|---|---|
Tboil | 447.3 ± 0.6 | K | AVG | N/A | Average of 6 values; Individual data points |
Quantity | Value | Units | Method | Reference | Comment |
Tfus | 326.1 ± 0.8 | K | AVG | N/A | Average of 26 values; Individual data points |
Quantity | Value | Units | Method | Reference | Comment |
Ttriple | 326.150 | K | N/A | Dworkin, Figuiere, et al., 1976, 2 | Crystal phase 1 phase; Uncertainty assigned by TRC = 0.01 K; TRC |
Quantity | Value | Units | Method | Reference | Comment |
ΔvapH° | 13.1 | kcal/mol | GC | Spieksma, Luijk, et al., 1994 | Based on data from 413. to 453. K.; AC |
ΔvapH° | 11.4 | kcal/mol | N/A | Boublik, Fried, et al., 1984 | Based on data from 370. to 450. K. See also Basarová and Svoboda, 1991.; AC |
Quantity | Value | Units | Method | Reference | Comment |
ΔsubH° | 15.48 ± 0.036 | kcal/mol | DM | Oonk, van Genderen, et al., 2000 | AC |
ΔsubH° | 15.6 ± 0.48 | kcal/mol | C | An and Zheng, 1989 | AC |
Enthalpy of vaporization
ΔvapH (kcal/mol) | Temperature (K) | Method | Reference | Comment |
---|---|---|---|---|
11.1 | 326. | N/A | Rohác, Ruzicka, et al., 1999 | AC |
10.6 | 373. | EB | Rohác, Ruzicka, et al., 1998 | Based on data from 358. to 448. K.; AC |
10.8 | 356. | A | Stephenson and Malanowski, 1987 | Based on data from 341. to 448. K.; AC |
Antoine Equation Parameters
log10(P) = A − (B / (T + C))
P = vapor pressure (atm)
T = temperature (K)
View plot Requires a JavaScript / HTML 5 canvas capable browser.
Temperature (K) | A | B | C | Reference |
---|---|---|---|---|
341.12 to 447.21 | 4.117 | 1575.11 | -64.637 | McDonald, Shrader, et al., 1959 |
Enthalpy of sublimation
ΔsubH (kcal/mol) | Temperature (K) | Method | Reference | Comment |
---|---|---|---|---|
12.7 | 258. to 313. | N/A | Liu and Dickhut, 1994 | AC |
15.6 | 313. | GS | Shaub, 1985 | Based on data from 303. to 423. K.; AC |
15.5 ± 0.1 | 303. | V | Walsh and Smith, 1961 | ALS |
15.5 ± 0.2 | 303. | N/A | Walsh and Smith, 1961, 2 | Based on data from 293. to 311. K. See also Cox and Pilcher, 1970.; AC |
15. ± 0.1 | 318. | N/A | Walsh and Smith, 1961, 2 | Based on data from 311. to 325. K.; AC |
13.6 | 275. | ME | Darkis, Vermillion, et al., 1940 | Based on data from 248. to 303. K. See also Jones, 1960.; AC |
Enthalpy of fusion
ΔfusH (kcal/mol) | Temperature (K) | Method | Reference | Comment |
---|---|---|---|---|
4.348 | 326.2 | DSC | Wei and Jin, 2009 | See also Wei, 2008.; AC |
4.281 | 326.2 | AC | van der Linde, van Miltenburg, et al., 2005 | Based on data from 5. to 380. K.; AC |
4.340 | 326. | N/A | Acree, 1991 | AC |
4.3141 | 326.15 | N/A | Booss and Hauschildt, 1972 | DH |
4.3403 | 326. | N/A | Ueberreiter and Orthmann, 1950 | DH |
4.3365 | 326.05 | N/A | Narbutt, 1918 | DH |
Entropy of fusion
ΔfusS (cal/mol*K) | Temperature (K) | Reference | Comment |
---|---|---|---|
13.2 | 326.15 | Booss and Hauschildt, 1972 | DH |
13.3 | 326. | Ueberreiter and Orthmann, 1950 | DH |
13.3 | 326.05 | Narbutt, 1918 | DH |
Enthalpy of phase transition
ΔHtrs (kcal/mol) | Temperature (K) | Initial Phase | Final Phase | Reference | Comment |
---|---|---|---|---|---|
0.0478 | 304.0 | crystaline, II | crystaline, I | Petropavlov, Tsygankova, et al., 1988 | DH |
0.3002 | 271.77 | crystaline, III | crystaline, II | Dworkin, Figuiere, et al., 1976 | DH |
0.05127 | 304.35 | crystaline, II | crystaline, I | Dworkin, Figuiere, et al., 1976 | DH |
4.3468 | 326.14 | crystaline, I | liquid | Dworkin, Figuiere, et al., 1976 | DH |
0.3002 | 271.77 | crystaline, III | crystaline, II | Dworkin, Figuiere, et al., 1975 | DH |
0.05127 | 304.35 | crystaline, II | crystaline, I | Dworkin, Figuiere, et al., 1975 | DH |
4.3468 | 326.14 | crystaline, I | liquid | Dworkin, Figuiere, et al., 1975 | DH |
Entropy of phase transition
ΔStrs (cal/mol*K) | Temperature (K) | Initial Phase | Final Phase | Reference | Comment |
---|---|---|---|---|---|
0.1 | 304.0 | crystaline, II | crystaline, I | Petropavlov, Tsygankova, et al., 1988 | DH |
1.10 | 271.77 | crystaline, III | crystaline, II | Dworkin, Figuiere, et al., 1976 | DH |
0.168 | 304.35 | crystaline, II | crystaline, I | Dworkin, Figuiere, et al., 1976 | DH |
13.33 | 326.14 | crystaline, I | liquid | Dworkin, Figuiere, et al., 1976 | DH |
1.10 | 271.77 | crystaline, III | crystaline, II | Dworkin, Figuiere, et al., 1975 | DH |
0.168 | 304.35 | crystaline, II | crystaline, I | Dworkin, Figuiere, et al., 1975 | DH |
13.33 | 326.14 | crystaline, I | liquid | Dworkin, Figuiere, et al., 1975 | DH |

Reaction thermochemistry data

Data compiled as indicated in comments:
B - John E. Bartmess
ALS - Hussein Y. Afeefy, Joel F. Liebman, and Stephen E. Stein
Individual Reactions
C6H3Cl2- + =
By formula: C6H3Cl2- + H+ = C6H4Cl2
Quantity | Value | Units | Method | Reference | Comment |
---|---|---|---|---|---|
ΔrH° | 377.0 ± 2.1 | kcal/mol | G+TS | Schlosser, Marzi, et al., 2001 | gas phase; Acid: p-dichlorobenzene.; B |
Quantity | Value | Units | Method | Reference | Comment |
ΔrG° | 368.8 ± 2.0 | kcal/mol | IMRE | Schlosser, Marzi, et al., 2001 | gas phase; Acid: p-dichlorobenzene.; B |
By formula: C6H4Cl2 = C6H4Cl2
Quantity | Value | Units | Method | Reference | Comment |
---|---|---|---|---|---|
ΔrH° | 0.96 | kcal/mol | Eqk | Godnev and Sverdlin, 1961 | gas phase; Correction of 56GOD/SVE; ALS |
By formula: C6H4Cl2 = C6H4Cl2
Quantity | Value | Units | Method | Reference | Comment |
---|---|---|---|---|---|
ΔrH° | 2.104 | kcal/mol | Eqk | Godnev and Sverdlin, 1961 | gas phase; Correction of 56GOD/SVE; ALS |

Gas phase ion energetics data

Data evaluated as indicated in comments:
L - Sharon G. Lias
Data compiled as indicated in comments:
B - John E. Bartmess
LL - Sharon G. Lias and Joel F. Liebman
LBLHLM - Sharon G. Lias, John E. Bartmess, Joel F. Liebman, John L. Holmes, Rhoda D. Levin, and W. Gary Mallard
LLK - Sharon G. Lias, Rhoda D. Levin, and Sherif A. Kafafi
RDSH - Henry M. Rosenstock, Keith Draxl, Bruce W. Steiner, and John T. Herron
Quantity | Value | Units | Method | Reference | Comment |
---|---|---|---|---|---|
IE (evaluated) | 8.92 ± 0.03 | eV | N/A | N/A | L |
Quantity | Value | Units | Method | Reference | Comment |
ΔfH°(+) ion | 211.1 | kcal/mol | N/A | N/A | |
Quantity | Value | Units | Method | Reference | Comment |
ΔfH(+) ion,0K | 214.1 | kcal/mol | N/A | N/A |
Ionization energy determinations
IE (eV) | Method | Reference | Comment |
---|---|---|---|
8.95 | PE | Fujisawa, Oonishi, et al., 1991 | LL |
8.92 ± 0.02 | PIPECO | Olesik, Baer, et al., 1986 | LBLHLM |
8.97 ± 0.03 | PE | Ruscic, Klasinc, et al., 1981 | LLK |
8.94 | PE | Kimura, Katsumata, et al., 1981 | LLK |
8.98 ± 0.02 | PE | Maier and Marthaler, 1978 | LLK |
8.89 ± 0.01 | EQ | Lias and Ausloos, 1978 | LLK |
8.94 ± 0.01 | PI | Watanabe, Nakayama, et al., 1962 | RDSH |
8.95 | PI | Bralsford, Harris, et al., 1960 | RDSH |
8.988 | PE | Potts, Lyus, et al., 1980 | Vertical value; LLK |
9.00 | PE | Streets and Ceasar, 1973 | Vertical value; LLK |
Appearance energy determinations
Ion | AE (eV) | Other Products | Method | Reference | Comment |
---|---|---|---|---|---|
C6H4Cl+ | 13.2 ± 0.1 | Cl | EI | Brown, 1970 | RDSH |
De-protonation reactions
C6H3Cl2- + =
By formula: C6H3Cl2- + H+ = C6H4Cl2
Quantity | Value | Units | Method | Reference | Comment |
---|---|---|---|---|---|
ΔrH° | 377.0 ± 2.1 | kcal/mol | G+TS | Schlosser, Marzi, et al., 2001 | gas phase; Acid: p-dichlorobenzene.; B |
Quantity | Value | Units | Method | Reference | Comment |
ΔrG° | 368.8 ± 2.0 | kcal/mol | IMRE | Schlosser, Marzi, et al., 2001 | gas phase; Acid: p-dichlorobenzene.; B |

Henry's Law data

Data compiled by: Rolf Sander
Henry's Law constant (water solution)
kH(T) = k°H exp(d(ln(kH))/d(1/T) ((1/T) - 1/(298.15 K)))
k°H = Henry's law constant for solubility in water at 298.15 K (mol/(kg*bar))
d(ln(kH))/d(1/T) = Temperature dependence constant (K)
k°H (mol/(kg*bar)) | d(ln(kH))/d(1/T) (K) | Method | Reference | Comment |
---|---|---|---|---|
0.23 | Q | N/A | missing citation give several references for the Henry's law constants but don't assign them to specific species. | |
0.31 | 2700. | X | N/A | |
0.31 | 2700. | X | N/A | |
0.38 | 2700. | X | N/A | |
0.63 | L | N/A | ||
0.42 | M | N/A | ||
0.22 | V | N/A |

Normal alkane RI, non-polar column, custom temperature program

Data compiled by: NIST Mass Spectrometry Data Center, William E. Wallace, director

Column type CapillaryCapillaryCapillaryCapillaryCapillary
Active phase Polydimethyl siloxane with 5 % Ph groupsPolydimethyl siloxane with 5 % Ph groupsPolydimethyl siloxane, 5 % phenylRTX-5 MSRTX-5 MS
Column length (m)    30.30.
Carrier gas    HeliumHelium
Substrate
Column diameter (mm)    0.250.25
Phase thickness (μm)    0.250.25
Program not specifiednot specifiednot specified50 0C (5 min) 2 0C/min -> 100 0C (5 min) 5 0C/min -> 300 0Cnot specified
I 1015.1024.1007.1014.1016.
ReferenceRobinson, Adams, et al., 2012Robinson, Adams, et al., 2012Skogerson, Wohlgemuth, et al., 2011Mebazaa, Mahmoudi, et al., 2009Mebazaa, Mahmoudi, et al., 2009
Comment MSDC-RI MSDC-RI MSDC-RI MSDC-RI MSDC-RI
Column type CapillaryCapillaryCapillaryCapillaryCapillary
Active phase Polydimethyl siloxanesMethyl SiliconeCP Sil 2Polydimethyl siloxanesDB-5
Column length (m)   55. 30.
Carrier gas   N2 He
Substrate
Column diameter (mm)   0.25
Phase thickness (μm)   0.25
Program not specifiednot specified40C(3min) => 20C/min => 80C => 2C/min => 240C(45min)not specifiednot specified
I 1057.970.989.1009.1050.
ReferenceZenkevich, Eliseenkov, et al., 2006Yu and Zazhi, 2005Fuhrer, Deissler, et al., 1997Zenkevich and Chupalov, 1996Sorimachi, Tanabe, et al., 1995
Comment MSDC-RI MSDC-RI MSDC-RI MSDC-RI MSDC-RI
Column type CapillaryCapillaryCapillaryCapillaryCapillary
Active phase DB-1SPB-1PTE-5Ultra-2SE-30
Column length (m) 60.30.25.25.60.
Carrier gas     N2
Substrate
Column diameter (mm) 0.320.320.200.200.32
Phase thickness (μm) 0.25 0.330.33
Program not specifiednot specified50 0C (2 min) 30 0C/min -> 200 0C 8 0C/min -> 280 0C (10 min)50 0C (2 min) 30 0C/min -> 200 0C 8 0C/min -> 280 0C (10 min)50C(8min) => 3C/min => 150C => 35C/min => 275C (10min)
I 986.988.1047.1029.987.
ReferenceCiccioli, Cecinato, et al., 1994Vezzani, Moretti, et al., 1994Nakano, Fujimori, et al., 1992Nakano, Fujimori, et al., 1992Ibrahim and Suffet, 1988
Comment MSDC-RI MSDC-RI MSDC-RI MSDC-RI MSDC-RI
Column type CapillaryCapillaryCapillaryCapillaryCapillary
Active phase OV-1OV-1, SE-30, Methyl silicone, SP-2100, OV-101, DB-1, etc.OV-1, SE-30, Methyl silicone, SP-2100, OV-101, DB-1, etc.OV-1, SE-30, Methyl silicone, SP-2100, OV-101, DB-1, etc.OV-1, SE-30, Methyl silicone, SP-2100, OV-101, DB-1, etc.
Column length (m) 50.50.50.50.50.
Carrier gas HydrogenHydrogenHydrogenHydrogenHydrogen
Substrate
Column diameter (mm) 0.320.320.320.320.32
Phase thickness (μm)
Program not specifiednot specifiednot specifiednot specifiednot specified
I 985.1000.985.988.995.
ReferenceWaggott and Davies, 1984Waggott and Davies, 1984Waggott and Davies, 1984Waggott and Davies, 1984Waggott and Davies, 1984
Comment MSDC-RI MSDC-RI MSDC-RI MSDC-RI MSDC-RI
Column type CapillaryOther
Active phase OV-1Methyl Silicone
Column length (m)
Carrier gas
Substrate
Column diameter (mm)
Phase thickness (μm)
Program not specifiednot specified
I 994.1023.
ReferenceRamsey and Flanagan, 1982Ardrey and Moffat, 1981
Comment MSDC-RI MSDC-RI

Kovats' RI, non-polar column, isothermal

Data compiled by: NIST Mass Spectrometry Data Center, William E. Wallace, director

Column type CapillaryCapillaryCapillaryCapillaryCapillary
Active phase DB-5DB-5DB-5DB-5SE-30
Column length (m) 60.60.60.60.
Carrier gas HeHeHeHe
Substrate
Column diameter (mm) 0.320.320.320.32
Phase thickness (μm) 1.1.1.1.
Temperature (C) 100.100.120.120.160.
I 1023.151023.181032.511032.761016.0
ReferenceHarangi, 2003Harangi, 2003Harangi, 2003Harangi, 2003Santiuste, Harangi, et al., 2003
Comment MSDC-RI MSDC-RI MSDC-RI MSDC-RI MSDC-RI
Column type CapillaryCapillaryCapillaryCapillaryCapillary
Active phase HP-5HP-5HP-5SPB-1SE-30
Column length (m)  60.60.30.
Carrier gas  N2N2
Substrate
Column diameter (mm)  0.250.250.32
Phase thickness (μm)  0.250.250.25
Temperature (C) 120.120.140.140.0.
I 1037.41037.41046.1012.993.
ReferenceSantiuste, Harangi, et al., 2003Santiuste J.M. and Takacs J.M., 2003Santiuste J.M. and Takacs J.M., 2003Vezzani, Bertocchi, et al., 1998Spieksma, Luijk, et al., 1994
Comment MSDC-RI MSDC-RI MSDC-RI MSDC-RI MSDC-RI
Column type CapillaryCapillaryCapillaryCapillaryCapillary
Active phase SE-30SE-30SE-30SE-30SE-30
Column length (m) 25. 25.25.25.
Carrier gas   N2N2N2
Substrate
Column diameter (mm) 0.32 0.220.220.22
Phase thickness (μm)
Temperature (C) 160.160.120.140.160.
I 970.1016.970.1015.1016.
ReferenceEvans and Haken, 1989Tarjan, Nyiredy, et al., 1989Haken and Korhonene, 1983Haken and Korhonene, 1983Haken and Korhonene, 1983
Comment MSDC-RI MSDC-RI MSDC-RI MSDC-RI MSDC-RI

Normal alkane RI, polar column, custom temperature program

Data compiled by: NIST Mass Spectrometry Data Center, William E. Wallace, director

Column type CapillaryCapillaryCapillaryCapillaryCapillary
Active phase DB-FFAPDB-FFAPBP-20BP-20Carbowax 20M
Column length (m) 30.30.30.30.
Carrier gas HeliumHeliumHeHe
Substrate
Column diameter (mm) 0.250.250.250.25
Phase thickness (μm) 0.250.250.250.25
Program 50 0C 2 0C/min -> 100 0C (5 min) 5 0C/min -> 250 0Cnot specified50C(1min) => 2.5C/min => 100C => 2C/min => 180C => 15C/min => 220C50C(1min) => 2.5C/min => 100C => 2C/min => 180C => 15C/min => 220Cnot specified
I 1420.1434.1436.1436.1495.
ReferenceMebazaa, Mahmoudi, et al., 2009Mebazaa, Mahmoudi, et al., 2009Pontes, Marques, et al., 2007Pontes, Marques, et al., 2007Ramsey and Flanagan, 1982
Comment MSDC-RI MSDC-RI MSDC-RI MSDC-RI MSDC-RI

Lee's RI, non-polar column, custom temperature program

Data compiled by: NIST Mass Spectrometry Data Center, William E. Wallace, director

Column type CapillaryCapillary
Active phase Methyl SiliconeMethyl Silicone
Column length (m)
Carrier gas
Substrate
Column diameter (mm)
Phase thickness (μm)
Program not specifiednot specified
I 163.15164.81
ReferenceEckel, Ross, et al., 1993Eckel, Ross, et al., 1993
Comment MSDC-RI MSDC-RI

References

Platonov and Simulin, 1984
Platonov, V.A.; Simulin, Yu.N.,
Experimental determination of the standard enthalpies of formation of polychlorobenzenes. II. Standard enthalpies of formation of dichlorobenzenes,
Russ. J. Phys. Chem. (Engl. Transl.), 1984, 58, 1630-1632. [all data]
Smith, Bjellerup, et al., 1953
Smith, L.; Bjellerup, L.; Krook, S.; Westermark, H.,
Heats of combustion of organic chloro compounds determined by the "quartz wool" method,
Acta Chem. Scand., 1953, 7, 65. [all data]
Hubbard, Knowlton, et al., 1954
Hubbard, W.N.; Knowlton, J.W.; Huffman, H.M.,
Combustion calorimetry of organic chlorine compounds. Heats of combustion of chlorobenzene, the dichlorobenzenes and o- and p-chloroethylbenzene,
J. Phys. Chem., 1954, 58, 396. [all data]
Dworkin, Figuiere, et al., 1976
Dworkin, A.; Figuiere, P.; Ghelfenstein, M.; Szwarc, H.,
Heat capacities, enthalpies of transition, and thermodynamic properties of the three solid phases of p-dichlorobenzene from 20 to 330 K,
J. Chem. Thermodynam., 1976, 8, 835-844. [all data]
Martin and Monti, 1988
Martin, C.A.; Monti, G.A.,
Dynamical analysis of the specific heat in p-dichlorobenzene,
Thermochim. Acta, 1988, 134, 35-39. [all data]
Ueberreiter and Orthmann, 1950
Ueberreiter, K.; Orthmann, H.-J.,
Specifische Wärme, spezifisches Volumen, Temperatur- und Wärme-leittähigkeit einiger disubstituierter Benzole und polycyclischer Systeme,
Z. Natursforsch. 5a, 1950, 101-108. [all data]
Andrews and Haworth, 1928
Andrews, D.H.; Haworth, E.,
An application of the rule of Dulong and Petit to molecules,
J. Am. Chem. Soc., 1928, 50, 2998-3002. [all data]
Narbutt, 1918
Narbutt, J.,
Die Spezifischen Warmen und Schmelzwarmen der dichloro-, chlorbrom-, dibrom-, bromjod-, und dijodbenzole. I,
Z. Elektrochem., 1918, 24, 339-342. [all data]
Dworkin, Figuiere, et al., 1976, 2
Dworkin, A.; Figuiere, P.; Ghelfenstein, M.; Szwarc, H.,
Heat Capacities, Enthalpies of Transition, and Thermodynamic Properties of the Three Solid Phases of p-Dichlorobenzene from 20 to 330 K,
J. Chem. Thermodyn., 1976, 8, 835-44. [all data]
Spieksma, Luijk, et al., 1994
Spieksma, Walter; Luijk, Ronald; Govers, Harrie A.J.,
Determination of the liquid vapour pressure of low-volatility compounds from the Kováts retention index,
Journal of Chromatography A, 1994, 672, 1-2, 141-148, https://doi.org/10.1016/0021-9673(94)80602-0
. [all data]
Boublik, Fried, et al., 1984
Boublik, T.; Fried, V.; Hala, E.,
The Vapour Pressures of Pure Substances: Selected Values of the Temperature Dependence of the Vapour Pressures of Some Pure Substances in the Normal and Low Pressure Region, 2nd ed., Elsevier, New York, 1984, 972. [all data]
Basarová and Svoboda, 1991
Basarová, Pavlína; Svoboda, Václav,
Calculation of heats of vaporization of halogenated hydrocarbons from saturated vapour pressure data,
Fluid Phase Equilibria, 1991, 68, 13-34, https://doi.org/10.1016/0378-3812(91)85008-I
. [all data]
Oonk, van Genderen, et al., 2000
Oonk, Harry A.J.; van Genderen, Aad C.G.; Blok, Jacobus G.; van der Linde, Peter R.,
Vapour pressures of crystalline and liquid 1,4-dibromo- and 1,4-dichlorobenzene; lattice energies of 1,4-dihalobenzenes,
Phys. Chem. Chem. Phys., 2000, 2, 24, 5614-5618, https://doi.org/10.1039/b005324o
. [all data]
An and Zheng, 1989
An, Xuwu; Zheng, Xiaolin,
Determination of Standard Enthalpies of Vaporization and Sublimation of Three Dichlorobenzenes,
Acta Phys. Chim. Sin., 1989, 5, 4, 487-491, https://doi.org/10.3866/PKU.WHXB19890421
. [all data]
Rohác, Ruzicka, et al., 1999
Rohác, Vladislav; Ruzicka, Vlastimil; Ruzicka, Kvetoslav; Polednicek, Milos; Aim, Karel; Jose, Jacques; Zábranský, Milan,
Recommended vapour and sublimation pressures and related thermal data for chlorobenzenes,
Fluid Phase Equilibria, 1999, 157, 1, 121-142, https://doi.org/10.1016/S0378-3812(99)00003-5
. [all data]
Rohác, Ruzicka, et al., 1998
Rohác, Vladislav; Ruzicka, Vlastimil; Ruzicka, Kvetoslav; Aim, Karel,
Measurements of Saturated Vapor Pressure above the Liquid Phase for Isomeric Dichlorobenzenes and 1,2,4-Trichlorobenzene,
J. Chem. Eng. Data, 1998, 43, 5, 770-775, https://doi.org/10.1021/je9701442
. [all data]
Stephenson and Malanowski, 1987
Stephenson, Richard M.; Malanowski, Stanislaw,
Handbook of the Thermodynamics of Organic Compounds, 1987, https://doi.org/10.1007/978-94-009-3173-2
. [all data]
McDonald, Shrader, et al., 1959
McDonald, R.A.; Shrader, S.A.; Stull, D.R.,
Vapor Pressures and Freezing Points of Thirty Pure Organic Compounds.,
J. Chem. Eng. Data, 1959, 4, 4, 311-313, https://doi.org/10.1021/je60004a009
. [all data]
Liu and Dickhut, 1994
Liu, Kewen; Dickhut, Rebecca M.,
Saturation vapor pressures and thermodynamic properties of benzene and selected chlorinated benzenes at environmental temperatures,
Chemosphere, 1994, 29, 3, 581-589, https://doi.org/10.1016/0045-6535(94)90445-6
. [all data]
Shaub, 1985
Shaub, W.M.,
Containment of dioxin emissions from refuse fired thermal processing units - prospects and technical issues,
Thermochimica Acta, 1985, 85, 435-438, https://doi.org/10.1016/0040-6031(85)85614-8
. [all data]
Walsh and Smith, 1961
Walsh, P.N.; Smith, N.O.,
Sublimation pressure of a-p-dichloro-,β-p-dichloro-, p-dibromo-, and p-bromochlorobenzene,
J. Chem. Eng. Data, 1961, 6, 33. [all data]
Walsh and Smith, 1961, 2
Walsh, P.N.; Smith, N.O.,
Sublimation Pressure of α-p-Dichloro-β-p-Dichloro, and p-Dibromo-, and p-Bromochlorobenzene.,
J. Chem. Eng. Data, 1961, 6, 1, 33-35, https://doi.org/10.1021/je60009a010
. [all data]
Cox and Pilcher, 1970
Cox, J.D.; Pilcher, G.,
Thermochemistry of Organic and Organometallic Compounds, Academic Press Inc., London, 1970, 643. [all data]
Darkis, Vermillion, et al., 1940
Darkis, F.R.; Vermillion, H.E.; Gross, P.M.,
p--Dichlorobenzene as a Vapor Fumigant Physical and Chemical Studies,
Ind. Eng. Chem., 1940, 32, 7, 946-949, https://doi.org/10.1021/ie50367a018
. [all data]
Jones, 1960
Jones, A.H.,
Sublimation Pressure Data for Organic Compounds.,
J. Chem. Eng. Data, 1960, 5, 2, 196-200, https://doi.org/10.1021/je60006a019
. [all data]
Wei and Jin, 2009
Wei, Dongwei; Jin, Kexin,
(Solid+liquid) equilibria of (naphthalene+isomeric dichlorobenzenes),
The Journal of Chemical Thermodynamics, 2009, 41, 2, 145-149, https://doi.org/10.1016/j.jct.2008.10.005
. [all data]
Wei, 2008
Wei, Dongwei,
(Solid+liquid) equilibria of (phenanthrene+dichlorobenzenes),
Thermochimica Acta, 2008, 479, 1-2, 32-36, https://doi.org/10.1016/j.tca.2008.09.010
. [all data]
van der Linde, van Miltenburg, et al., 2005
van der Linde, Peter R.; van Miltenburg, J. Cees; van den Berg, Gerrit J.K.; Oonk, Harry A.J.,
Low-Temperature Heat Capacities and Derived Thermodynamic Functions of 1,4-Dichlorobenzene, 1,4-Dibromobenzene, 1,3,5-Trichlorobenzene, and 1,3,5-Tribromobenzene,
J. Chem. Eng. Data, 2005, 50, 1, 164-172, https://doi.org/10.1021/je049762q
. [all data]
Acree, 1991
Acree, William E.,
Thermodynamic properties of organic compounds: enthalpy of fusion and melting point temperature compilation,
Thermochimica Acta, 1991, 189, 1, 37-56, https://doi.org/10.1016/0040-6031(91)87098-H
. [all data]
Booss and Hauschildt, 1972
Booss, H.J.; Hauschildt, K.R.,
Die Schmelzenthalpie des Benzils und 4-Nitrophenols,
Z. Anal. Chem., 1972, 261(1), 32. [all data]
Petropavlov, Tsygankova, et al., 1988
Petropavlov, N.N.; Tsygankova, I.G.; Teslenko, L.A.,
Microcalorimetric investigation of polymorphic transitions in organic crystals,
Sov. Phys. Crystallogr., 1988, 33(6), 853-855. [all data]
Dworkin, Figuiere, et al., 1975
Dworkin, A.; Figuiere, P.; Ghelfenstein, M.; Szwarc, H.,
Thermodynamic properties of the three solid phases of p-dichlorobenzene,
Quatrieme Conference International de Thermodynamique Chimique, 1975, II, Thermophysique (capacites thermiques) pp. [all data]
Schlosser, Marzi, et al., 2001
Schlosser, M.; Marzi, E.; Cottet, F.; Buker, H.H.; Nibbering, N.M.M.,
The acidity of chloro-substituted benzenes: A comparison of gas phase, ab initio, and kinetic data,
Chem. Eur. J., 2001, 7, 16, 3511-3516, https://doi.org/10.1002/1521-3765(20010817)7:16<3511::AID-CHEM3511>3.0.CO;2-U
. [all data]
Godnev and Sverdlin, 1961
Godnev, I.N.; Sverdlin, A.S.,
Equilibrium and dichlorobenzene isomer (Corrections),
Russ. J. Phys. Chem. (Engl. Transl.), 1961, 35, 231-232. [all data]
Fujisawa, Oonishi, et al., 1991
Fujisawa, S.; Oonishi, I.; Masuda, S.; Ohno, K.; Harada, Y.,
Penning ionization electron spectroscopy of dichlorobenzenes,
J. Phys. Chem., 1991, 95, 4250. [all data]
Olesik, Baer, et al., 1986
Olesik, S.; Baer, T.; Morrow, J.C.,
Dissociation rates of energy-selected dichloro- and dibromobenzene ions,
J. Phys. Chem., 1986, 90, 3563. [all data]
Ruscic, Klasinc, et al., 1981
Ruscic, B.; Klasinc, L.; Wolf, A.; Knop, J.V.,
Photoelectron spectra of and Ab initio calculations on chlorobenzenes. 1. Chlorobenzene and dichlorobenzenes,
J. Phys. Chem., 1981, 85, 1486. [all data]
Kimura, Katsumata, et al., 1981
Kimura, K.; Katsumata, S.; Achiba, Y.; Yamazaki, T.; Iwata, S.,
Ionization energies, Ab initio assignments, and valence electronic structure for 200 molecules
in Handbook of HeI Photoelectron Spectra of Fundamental Organic Compounds, Japan Scientific Soc. Press, Tokyo, 1981. [all data]
Maier and Marthaler, 1978
Maier, J.P.; Marthaler, O.,
Emission spectra of the radical cations of 1,3-dichlorobenzene, 1,4-dichlorobenzene and 1,3,5-trichlorobenzene in the gas phase,
Chem. Phys., 1978, 32, 419. [all data]
Lias and Ausloos, 1978
Lias, S.G.; Ausloos, P.J.,
eIonization energies of organic compounds by equilibrium measurements,
J. Am. Chem. Soc., 1978, 100, 6027. [all data]
Watanabe, Nakayama, et al., 1962
Watanabe, K.; Nakayama, T.; Mottl, J.,
Ionization potentials of some molecules,
J. Quant. Spectry. Radiative Transfer, 1962, 2, 369. [all data]
Bralsford, Harris, et al., 1960
Bralsford, R.; Harris, P.V.; Price, W.C.,
The effect of fluorine on the electronic spectra and ionization potentials of molecules,
Proc. Roy. Soc. (London), 1960, A258, 459. [all data]
Potts, Lyus, et al., 1980
Potts, A.W.; Lyus, M.L.; Lee, E.P.F.; Fattahallah, G.H.,
High resolution ultraviolet photoelectron spectra of C6H5X and p-C6H4X2 where X = Cl, Br or I,
J. Chem. Soc. Faraday Trans. 2, 1980, 76, 556. [all data]
Streets and Ceasar, 1973
Streets, D.G.; Ceasar, G.P.,
Inductive mesomeric effects on the π orbitals of halobenzenes,
Mol. Phys., 1973, 26, 1037. [all data]
Brown, 1970
Brown, P.,
Kinetic studies in mass spectrometry-IV. The [M - Cl] reaction in substituted chlorobenzenes and the question of molecular ion isomerization,
Org. Mass Spectrom., 1970, 3, 639. [all data]