Hexaphenylditin
- Formula: C36H30Sn2
- Molecular weight: 700.043
- IUPAC Standard InChIKey: UAPQJVJCJITJET-UHFFFAOYSA-N
- CAS Registry Number: 1064-10-4
- Chemical structure:

Condensed phase thermochemistry data

Data compiled by: José A. Martinho Simões
Quantity | Value | Units | Method | Reference | Comment |
---|---|---|---|---|---|
ΔfH°solid | 666.6 ± 9.6 | kJ/mol | Review | Martinho Simões | Selected data |
ΔfH°solid | 767. ± 17. | kJ/mol | Review | Martinho Simões | |
ΔfH°solid | 675. ± 30. | kJ/mol | Review | Martinho Simões | |
Quantity | Value | Units | Method | Reference | Comment |
ΔcH°solid | -20275.7 ± 8.4 | kJ/mol | CC-RB | Carson, Laye, et al., 1970 | Please also see Pedley and Rylance, 1977. |
ΔcH°solid | -20376. ± 17. | kJ/mol | CC-RB | Tel'noi and Rabinovich, 1966 | Please also see Cox and Pilcher, 1970. |
ΔcH°solid | -20284. ± 29. | kJ/mol | CC-RB | Lautsch, Tröber, et al., 1963 | Please also see Cox and Pilcher, 1970. |

Phase change data

Data compiled as indicated in comments:
MS - José A. Martinho Simões
AC - William E. Acree, Jr., James S. Chickos
Quantity | Value | Units | Method | Reference | Comment |
---|---|---|---|---|---|
ΔsubH° | 188.3 ± 4.2 | kJ/mol | CC-RB | Keiser and Kana'an, 1969 | MS |
ΔsubH° | 188.3 ± 4.2 | kJ/mol | ME,TE | Keiser and Kana'an, 1969, 2 | AC |

Gas phase ion energetics data

Data compiled by: Henry M. Rosenstock, Keith Draxl, Bruce W. Steiner, and John T. Herron
Appearance energy determinations
Ion | AE (eV) | Other Products | Method | Reference | Comment |
---|---|---|---|---|---|
C18H15Sn+ | 8.7 ± 0.2 | ? | EI | Chambers and Glockling, 1970 |

Gas phase thermochemistry data

Data compiled by: José A. Martinho Simões
Quantity | Value | Units | Method | Reference | Comment |
---|---|---|---|---|---|
ΔfH°gas | 855. ± 11. | kJ/mol | Review | Martinho Simões | Selected data |
ΔfH°gas | 955. ± 18. | kJ/mol | Review | Martinho Simões | |
ΔfH°gas | 863. ± 30. | kJ/mol | Review | Martinho Simões |

References

Martinho Simões
Martinho Simões, J.A.,
Private communication (see http://webbook.nist.gov/chemistry/om/). [all data]
Carson, Laye, et al., 1970
Carson, a.S.; Laye, P.G.; Spencer, J.A.; Steele, W.V.,
The enthalpy of combustion of organo-metallic compounds measured with a vacuum-jacketed aneroid calorimeter. The enthalpy of formation of di-tin hexaphenyl and some associated bond energies,
J. Chem. Thermodyn., 1970, 2, 659. [all data]
Pedley and Rylance, 1977
Pedley, J.B.; Rylance, J.,
Computer Analysed Thermochemical Data: Organic and Organometallic Compounds, University of Sussex, Brigton, 1977. [all data]
Tel'noi and Rabinovich, 1966
Tel'noi, V.I.; Rabinovich, I.B.,
Russ. J. Phys. Chem., 1966, 40, 842. [all data]
Cox and Pilcher, 1970
Cox, J.D.; Pilcher, G.,
Thermochemistry of Organic and Organometallic Compounds
in Academic Press, New York, 1970. [all data]
Lautsch, Tröber, et al., 1963
Lautsch, W.F.; Tröber, A.; Zimmer, W.; Mehner, L.; Linck, W.; Lehmann, H.M.; Brandenberger, H.; Korner, H.; Metschker, H.-J.; Wagner, K.; Kaden, R.,
Z. Chem., 1963, 3, 415. [all data]
Keiser and Kana'an, 1969
Keiser, D.; Kana'an, A.S.,
J. Phys. Chem., 1969, 73, 4264. [all data]
Keiser and Kana'an, 1969, 2
Keiser, D.; Kana'an, A.S.,
Enthalpy and entropy of sublimation of tetraphenyltin and hexaphenylditin. Bond dissociation energy of Sn-C and Sn-Sn,
J. Phys. Chem., 1969, 73, 12, 4264-4269, https://doi.org/10.1021/j100846a038
. [all data]
Chambers and Glockling, 1970
Chambers, D.B.; Glockling, F.,
Electron impact determination of heats of formation and bond energies in triphenyltin compounds,
Inorg. Chim. Acta, 1970, 4, 150. [all data]