Benzenamine, 4-bromo-
- Formula: C6H6BrN
- Molecular weight: 172.023
- IUPAC Standard InChIKey: WDFQBORIUYODSI-UHFFFAOYSA-N
- CAS Registry Number: 106-40-1
- Chemical structure:
View 3d structure (requires JavaScript / HTML 5) - Other names: Aniline, p-bromo-; p-Bromoaniline; p-Bromophenylamine; 4-Bromoaniline; 4-Bromanilinu

Phase change data

Data compiled as indicated in comments:
TRC - Thermodynamics Research Center, NIST Boulder Laboratories, Chris Muzny director
AC - William E. Acree, Jr., James S. Chickos
Quantity | Value | Units | Method | Reference | Comment |
---|---|---|---|---|---|
Tboil | 492.90 | K | N/A | Lecat, 1947 | Uncertainty assigned by TRC = 0.6 K; TRC |
Quantity | Value | Units | Method | Reference | Comment |
ΔsubH° | 79.4 ± 1.7 | kJ/mol | C | Ribeiro da Silva, Ferreira, et al., 2006 | AC |
Enthalpy of fusion
ΔfusH (kJ/mol) | Temperature (K) | Method | Reference | Comment |
---|---|---|---|---|
16.75 | 336. | DSC | Ribeiro da Silva, Ferreira, et al., 2006 | AC |
13.36 | 336. | N/A | Khanna, Khetarpal, et al., 1983 | AC |

Reaction thermochemistry data

Data compiled by: Hussein Y. Afeefy, Joel F. Liebman, and Stephen E. Stein
Individual Reactions
By formula: C6H6BrN + C4H2O3 = C10H8BrNO3
Quantity | Value | Units | Method | Reference | Comment |
---|---|---|---|---|---|
ΔrH° | 14. | kJ/mol | Cm | Srivastava, 1979 | solid phase |

Gas phase ion energetics data

Data compiled by: Henry M. Rosenstock, Keith Draxl, Bruce W. Steiner, and John T. Herron
Ionization energy determinations
IE (eV) | Method | Reference |
---|---|---|
7.7 ± 0.1 | CTS | Farrell and Newton, 1966 |
Appearance energy determinations
Ion | AE (eV) | Other Products | Method | Reference | Comment |
---|---|---|---|---|---|
C6H6N+ | 11.95 | Br | EI | Howe and Williams, 1969 |

Normal alkane RI, non-polar column, temperature ramp

Column type | Active phase | I | Reference | Comment |
---|---|---|---|---|
Capillary | TR-1 | 1248. | Gruzdev, Alferova, et al., 2011 | 30. m/0.32 mm/0.25 μm, Helium, 5. K/min; Tstart: 50. C; Tend: 300. C |
Capillary | TR-1 | 1248. | Gruzdev, Filippova, et al., 2011 | 30. m/0.32 mm/0.25 μm, Helium, 5. K/min; Tstart: 50. C; Tend: 300. C |
Capillary | Ultra-1 | 1245. | Okumura, 1991 | 25. m/0.32 mm/0.25 μm, He, 3. K/min; Tstart: 80. C; Tend: 260. C |

References

Lecat, 1947
Lecat, M.,
Orthobaric Azeotropes of Sulfides,
Bull. Cl. Sci., Acad. R. Belg., 1947, 33, 160-82. [all data]
Ribeiro da Silva, Ferreira, et al., 2006
Ribeiro da Silva, Manuel A.V.; Ferreira, Ana I.M.C.L.; Gomes, José R.B.,
Experimental and Computational Study on the Thermochemistry of Bromoanilines,
Bull. Chem. Soc. Jpn., 2006, 79, 12, 1852-1859, https://doi.org/10.1246/bcsj.79.1852
. [all data]
Khanna, Khetarpal, et al., 1983
Khanna, M.S.; Khetarpal, S.C.; Lal, K.; Bhatnagar, H.L.,
Thermodynamic studies on melting of some o-, m-, and p-halogen derivatives of aniline,
Indian J. Pure Appl. Phys., 1983, 20, 6, 503. [all data]
Srivastava, 1979
Srivastava, A.K.,
Solid-state reactions between maleic anhydride and substituted aromactic amines,
Z. Phys. Chem. (Leipzig), 1979, 260, 630-640. [all data]
Farrell and Newton, 1966
Farrell, P.G.; Newton, J.,
Ionization potentials of primary aromatic amines and aza-hydrocarbons,
Tetrahedron Lett., 1966, 5517. [all data]
Howe and Williams, 1969
Howe, I.; Williams, D.H.,
Calculation and qualitative predictions of mass spectra. Mono- and paradisubstituted benzenes,
J. Am. Chem. Soc., 1969, 91, 7137. [all data]
Girault-Vexlearschi, 1956
Girault-Vexlearschi, G.,
Influence de la ramification des chaines hydrocarbonees sur la basicite des amines. IV. Spectres d'absorption des alcoylarylamines,
Bull. Soc. Chim. Fr., 1956, 23, 606-613. [all data]
Gruzdev, Alferova, et al., 2011
Gruzdev, I.V.; Alferova, M.V.; Kondratenok, B.M.; Zenkevich, I.G.,
Gas-chromatographic identification of chloro- and bromosubstituted anilines using retention indices,
Rus. J. Anal. Chem., 2011, 66, 5, 519-524. [all data]
Gruzdev, Filippova, et al., 2011
Gruzdev, I.V.; Filippova, M.V.; Zenkevich, I.G.; Kondratenok, B.M.,
Identification of bromination products of chlorosubstituted anilines in aqueous media by using gas chromatography,
Rus. J. Applied Chem., 2011, 84, 10, 1656-1667, https://doi.org/10.1134/S1070427211100132
. [all data]
Okumura, 1991
Okumura, T.,
retention indices of environmental chemicals on methyl silicone capillary column,
Journal of Environmental Chemistry (Japan), 1991, 1, 2, 333-358, https://doi.org/10.5985/jec.1.333
. [all data]