Benzene, 1-bromo-4-methyl-
- Formula: C7H7Br
- Molecular weight: 171.034
- IUPAC Standard InChIKey: ZBTMRBYMKUEVEU-UHFFFAOYSA-N
- CAS Registry Number: 106-38-7
- Chemical structure:

Condensed phase thermochemistry data

Data compiled by: Hussein Y. Afeefy, Joel F. Liebman, and Stephen E. Stein
Quantity | Value | Units | Method | Reference | Comment |
---|---|---|---|---|---|
ΔfH°liquid | 12. | kJ/mol | Cm | Holm, 1973 | Grignard Rx |

Phase change data

Data compiled as indicated in comments:
BS - Robert L. Brown and Stephen E. Stein
TRC - Thermodynamics Research Center, NIST Boulder Laboratories, Chris Muzny director
AC - William E. Acree, Jr., James S. Chickos
Quantity | Value | Units | Method | Reference | Comment |
---|---|---|---|---|---|
Tboil | 457.5 | K | N/A | Weast and Grasselli, 1989 | BS |
Tboil | 457.7 | K | N/A | Lecat, 1927 | Uncertainty assigned by TRC = 0.5 K; TRC |
Tboil | 456.95 | K | N/A | Perkin, 1896 | Uncertainty assigned by TRC = 0.5 K; TRC |
Tboil | 456.15 | K | N/A | Kahlbaum, 1884 | Uncertainty assigned by TRC = 2. K; isomer not specifically identified; TRC |
Quantity | Value | Units | Method | Reference | Comment |
Tfus | 300. ± 2. | K | AVG | N/A | Average of 8 values; Individual data points |
Enthalpy of vaporization
ΔvapH (kJ/mol) | Temperature (K) | Method | Reference | Comment |
---|---|---|---|---|
47.1 | 335. | N/A | Dykyj, Svoboda, et al., 1999 | Based on data from 320. to 458. K.; AC |
55.3 | 288. | N/A | Dykyj, Svoboda, et al., 1999 | Based on data from 273. to 472. K.; AC |
45.8 | 373. | A | Stephenson and Malanowski, 1987 | Based on data from 358. to 523. K. See also Dykyj and Vanko, 1970 and Kkykj and Repas, 1973.; AC |
Antoine Equation Parameters
log10(P) = A − (B / (T + C))
P = vapor pressure (bar)
T = temperature (K)
View plot Requires a JavaScript / HTML 5 canvas capable browser.
Temperature (K) | A | B | C | Reference | Comment |
---|---|---|---|---|---|
283.4 to 457.7 | 6.40475 | 3516.111 | 92.523 | Stull, 1947 | Coefficents calculated by NIST from author's data. |
Enthalpy of fusion
ΔfusH (kJ/mol) | Temperature (K) | Reference | Comment |
---|---|---|---|
15.13 | 301.2 | van Miltenburg, Alvarez-Larena, et al., 1996 | AC |

Gas phase ion energetics data

Data evaluated as indicated in comments:
HL - Edward P. Hunter and Sharon G. Lias
L - Sharon G. Lias
Data compiled as indicated in comments:
B - John E. Bartmess
LBLHLM - Sharon G. Lias, John E. Bartmess, Joel F. Liebman, John L. Holmes, Rhoda D. Levin, and W. Gary Mallard
LLK - Sharon G. Lias, Rhoda D. Levin, and Sherif A. Kafafi
RDSH - Henry M. Rosenstock, Keith Draxl, Bruce W. Steiner, and John T. Herron
Quantity | Value | Units | Method | Reference | Comment |
---|---|---|---|---|---|
IE (evaluated) | 8.68 ± 0.02 | eV | N/A | N/A | L |
Quantity | Value | Units | Method | Reference | Comment |
Proton affinity (review) | 775.3 | kJ/mol | N/A | Hunter and Lias, 1998 | HL |
Quantity | Value | Units | Method | Reference | Comment |
Gas basicity | 745.8 | kJ/mol | N/A | Hunter and Lias, 1998 | HL |
Ionization energy determinations
IE (eV) | Method | Reference | Comment |
---|---|---|---|
8.42 | PE | Baidin, Misharev, et al., 1985 | LBLHLM |
8.68 ± 0.01 | EQ | Lias and Ausloos, 1978 | LLK |
8.67 | PE | Johnstone and Mellon, 1973 | LLK |
8.7 ± 0.1 | EI | Tajima and Tsuchiya, 1972 | LLK |
8.71 | PE | Baker, May, et al., 1968 | RDSH |
8.67 ± 0.02 | PI | Watanabe, 1957 | RDSH |
8.76 | PE | Baidin, Misharev, et al., 1985 | Vertical value; LBLHLM |
Appearance energy determinations
Ion | AE (eV) | Other Products | Method | Reference | Comment |
---|---|---|---|---|---|
C5H5+ | 15.2 ± 0.2 | C2H2+Br | EI | Tajima and Tsuchiya, 1973 | LLK |
C5H5+ | 15.23 ± 0.15 | C2H2+Br | EI | Tajima and Tsuchiya, 1972 | LLK |
C7H6Br+ | 12.48 | H | EI | Howe and Williams, 1969 | RDSH |
C7H7+ | 11.1 ± 0.3 | ? | EI | McLafferty and Winkler, 1974 | LLK |
C7H7+ | 11.2 ± 0.1 | ? | EI | Tajima and Tsuchiya, 1972 | LLK |
C7H7+ | 11.30 | Br | EI | Howe and Williams, 1969 | RDSH |
De-protonation reactions
C7H6Br- + =
By formula: C7H6Br- + H+ = C7H7Br
Quantity | Value | Units | Method | Reference | Comment |
---|---|---|---|---|---|
ΔrH° | 1564. ± 13. | kJ/mol | G+TS | Wenthold, Wierschke, et al., 1994 | gas phase; Between MeOCH2CH2OH and tBuCH2OH, near CH2Cl2; B |
Quantity | Value | Units | Method | Reference | Comment |
ΔrG° | 1533. ± 13. | kJ/mol | IMRB | Wenthold, Wierschke, et al., 1994 | gas phase; Between MeOCH2CH2OH and tBuCH2OH, near CH2Cl2; B |

Henry's Law data

Data compiled by: Rolf Sander
Henry's Law constant (water solution)
kH(T) = k°H exp(d(ln(kH))/d(1/T) ((1/T) - 1/(298.15 K)))
k°H = Henry's law constant for solubility in water at 298.15 K (mol/(kg*bar))
d(ln(kH))/d(1/T) = Temperature dependence constant (K)
k°H (mol/(kg*bar)) | d(ln(kH))/d(1/T) (K) | Method | Reference |
---|---|---|---|
0.43 | V | N/A |

Reaction thermochemistry data

Data compiled by: John E. Bartmess

Individual Reactions

C7H6Br- + Hydrogen cation = Benzene, 1-bromo-4-methyl-

By formula: C7H6Br- + H+ = C7H7Br

Quantity Value Units Method Reference Comment
Δr1564. ± 13.kJ/molG+TSWenthold, Wierschke, et al., 1994gas phase; Between MeOCH2CH2OH and tBuCH2OH, near CH2Cl2
Quantity Value Units Method Reference Comment
Δr1533. ± 13.kJ/molIMRBWenthold, Wierschke, et al., 1994gas phase; Between MeOCH2CH2OH and tBuCH2OH, near CH2Cl2

References

Holm, 1973
Holm, T.,
Thermochemistry of Grignard reagents. Enthalpies of formation of alkylmagnesium bromides and of alkyl bromides,
J. Organomet. Chem., 1973, 56, 87-93. [all data]
Weast and Grasselli, 1989
CRC Handbook of Data on Organic Compounds, 2nd Editon, Weast,R.C and Grasselli, J.G., ed(s)., CRC Press, Inc., Boca Raton, FL, 1989, 1. [all data]
Lecat, 1927
Lecat, M.,
New binary azeotropes: 7th list,
Ann. Soc. Sci. Bruxelles, Ser. B, 1927, 47, 108-14. [all data]
Perkin, 1896
Perkin, W.H.,
LXIX. On Magnetic Rotatory Power, especially of Aromatic Compounds,
J. Chem. Soc., 1896, 69, 1025-1257. [all data]
Kahlbaum, 1884
Kahlbaum, G.W.A.,
The dependence of Boiling Temperature on Air Pressure,
Ber. Dtsch. Chem. Ges., 1884, 17, 1245. [all data]
Dykyj, Svoboda, et al., 1999
Dykyj, J.; Svoboda, J.; Wilhoit, R.C.; Frenkel, M.L.; Hall, K.R.,
Vapor Pressure of Chemicals: Part A. Vapor Pressure and Antoine Constants for Hydrocarbons and Sulfur, Selenium, Tellurium and Hydrogen Containing Organic Compounds, Springer, Berlin, 1999, 373. [all data]
Stephenson and Malanowski, 1987
Stephenson, Richard M.; Malanowski, Stanislaw,
Handbook of the Thermodynamics of Organic Compounds, 1987, https://doi.org/10.1007/978-94-009-3173-2
. [all data]
Dykyj and Vanko, 1970
Dykyj, J.; Vanko, A.,
Petrochemica, 1970, 10, 1, 3. [all data]
Kkykj and Repas, 1973
Kkykj, J.; Repas, M.,
Petrochemia, 1973, 13, 179. [all data]
Stull, 1947
Stull, Daniel R.,
Vapor Pressure of Pure Substances. Organic and Inorganic Compounds,
Ind. Eng. Chem., 1947, 39, 4, 517-540, https://doi.org/10.1021/ie50448a022
. [all data]
van Miltenburg, Alvarez-Larena, et al., 1996
van Miltenburg, J.C.; Alvarez-Larena, A.; Labrador, M.; Palacios, L.; Rodriguez-Romero, J.; Tauler, E.; Estop, E.,
The thermal properties of three (Cl-, Br-, I-) para-halotoluenes. Formation of glassy crystals,
Thermochimica Acta, 1996, 273, 31-42, https://doi.org/10.1016/0040-6031(95)02596-0
. [all data]
Hunter and Lias, 1998
Hunter, E.P.; Lias, S.G.,
Evaluated Gas Phase Basicities and Proton Affinities of Molecules: An Update,
J. Phys. Chem. Ref. Data, 1998, 27, 3, 413-656, https://doi.org/10.1063/1.556018
. [all data]
Baidin, Misharev, et al., 1985
Baidin, V.N.; Misharev, A.D.; Takhistov, V.V.,
Effect of alkyl substituents on the ionization potentials of halogenobenzenes,
Zh. Org. Khim., 1985, 21, 817. [all data]
Lias and Ausloos, 1978
Lias, S.G.; Ausloos, P.J.,
eIonization energies of organic compounds by equilibrium measurements,
J. Am. Chem. Soc., 1978, 100, 6027. [all data]
Johnstone and Mellon, 1973
Johnstone, R.A.W.; Mellon, F.A.,
Effects of induction and resonance in the calculation of ionization potentials of substituted benzenes by perturbation molecular orbital theory,
J. Chem. Soc. Faraday Trans. 2, 1973, 69, 36. [all data]
Tajima and Tsuchiya, 1972
Tajima, S.; Tsuchiya, T.,
The effects of the repeller voltage and the shield voltage on appearance potential measurements by electron impact,
Shitsuryo Bunseki, 1972, 20, 117. [all data]
Baker, May, et al., 1968
Baker, A.D.; May, D.P.; Turner, D.W.,
Molecular photoelectron spectroscopy. Part VII. The vertical ionisation potentials of benzene and some of its monosubstituted and 1,4-disubstituted derivatives,
J. Chem. Soc. B, 1968, 22. [all data]
Watanabe, 1957
Watanabe, K.,
Ionization potentials of some molecules,
J. Chem. Phys., 1957, 26, 542. [all data]
Tajima and Tsuchiya, 1973
Tajima, S.; Tsuchiya, T.,
Energetics consideration of C5H5+ ions produced from various precursors by electron impact,
Bull. Chem. Soc. Jpn., 1973, 46, 3291. [all data]
Howe and Williams, 1969
Howe, I.; Williams, D.H.,
Calculation and qualitative predictions of mass spectra. Mono- and paradisubstituted benzenes,
J. Am. Chem. Soc., 1969, 91, 7137. [all data]
McLafferty and Winkler, 1974
McLafferty, F.W.; Winkler, J.,
Gaseous tropylium, benzyl, tolyl, and norbornadienyl cations,
J. Am. Chem. Soc., 1974, 96, 5182. [all data]
Wenthold, Wierschke, et al., 1994
Wenthold, P.G.; Wierschke, S.G.; Nash, J.J.; Squires, R.R.,
Biradical thermochemistry from collision-induced dissociation threshold energy measurements .2. Experimental and theoretical studies of the Mechanism and Thermochemistry of Formation of alph,
J. Am. Chem. Soc., 1994, 116, 16, 7378, https://doi.org/10.1021/ja00095a048
. [all data]