Propanoic acid, propyl ester
- Formula: C6H12O2
- Molecular weight: 116.1583
- IUPAC Standard InChIKey: MCSINKKTEDDPNK-UHFFFAOYSA-N
- CAS Registry Number: 106-36-5
- Chemical structure:
View 3d structure (requires JavaScript / HTML 5) - Other names: Propionic acid, propyl ester; n-Propyl propionate; Propyl propionate; Propionic acid n-propyl ester; Propyl propanoate; n-Propyl propanoate; Propylester kyseliny propionove; Propyl ester of propanoic acid; n-Propyl n-propionate; n-Propyl n-propanoate; NSC 72022

Condensed phase thermochemistry data

Data compiled as indicated in comments:
ALS - Hussein Y. Afeefy, Joel F. Liebman, and Stephen E. Stein
DH - Eugene S. Domalski and Elizabeth D. Hearing
Quantity | Value | Units | Method | Reference | Comment |
---|---|---|---|---|---|
ΔcH°liquid | -3545. | kJ/mol | Ccb | Schjanberg, 1935 | Corresponding ΔfHºliquid = -530.9 kJ/mol (simple calculation by NIST; no Washburn corrections); ALS |
Constant pressure heat capacity of liquid
Cp,liquid (J/mol*K) | Temperature (K) | Reference | Comment |
---|---|---|---|
229.00 | 298.38 | Zabransky, Hynek, et al., 1987 | T = 294 to 367 K. Unsmoothed experimental datum.; DH |
226.65 | 298.15 | Jimenez, Romani, et al., 1986 | DH |

Phase change data

Data compiled as indicated in comments:
BS - Robert L. Brown and Stephen E. Stein
TRC - Thermodynamics Research Center, NIST Boulder Laboratories, Chris Muzny director
ALS - Hussein Y. Afeefy, Joel F. Liebman, and Stephen E. Stein
AC - William E. Acree, Jr., James S. Chickos
Quantity | Value | Units | Method | Reference | Comment |
---|---|---|---|---|---|
Tboil | 396. ± 2. | K | AVG | N/A | Average of 13 values; Individual data points |
Quantity | Value | Units | Method | Reference | Comment |
Tfus | 197.3 | K | N/A | Timmermans, 1922 | Uncertainty assigned by TRC = 0.3 K; TRC |
Quantity | Value | Units | Method | Reference | Comment |
Tc | 571.0 | K | N/A | Young, 1994 | Uncertainty assigned by TRC = 1. K; TRC |
Tc | 568.6 | K | N/A | Quadri and Kudchadker, 1991 | Uncertainty assigned by TRC = 0.6 K; TRC |
Tc | 578. | K | N/A | Majer and Svoboda, 1985 | |
Tc | 563.7 | K | N/A | De Heen, 1888 | Uncertainty assigned by TRC = 6. K; TRC |
Tc | 578.0 | K | N/A | Pawlewski, 1882 | Uncertainty assigned by TRC = 8. K; TRC |
Quantity | Value | Units | Method | Reference | Comment |
Pc | 30.60 | bar | N/A | Quadri and Kudchadker, 1991 | Uncertainty assigned by TRC = 0.30 bar; TRC |
Quantity | Value | Units | Method | Reference | Comment |
ΔvapH° | 43.48 | kJ/mol | N/A | Majer and Svoboda, 1985 | |
ΔvapH° | 35.6 ± 0.01 | kJ/mol | V | Mathews, 1926 | ALS |
Enthalpy of vaporization
ΔvapH (kJ/mol) | Temperature (K) | Method | Reference | Comment |
---|---|---|---|---|
35.54 | 395.6 | N/A | Majer and Svoboda, 1985 | |
37.6 | 392. | N/A | Ortega and Galvan, 1994 | Based on data from 378. to 406. K.; AC |
39.9 | 351. | N/A | Fárková and Wichterle, 1993 | Based on data from 336. to 394. K.; AC |
43.1 | 274. | A | Stephenson and Malanowski, 1987 | Based on data from 259. to 396. K. See also Stull, 1947.; AC |
42.1 ± 0.1 | 313. | C | Svoboda, Uchytilová, et al., 1980 | AC |
41.1 ± 0.1 | 328. | C | Svoboda, Uchytilová, et al., 1980 | AC |
40.0 ± 0.1 | 343. | C | Svoboda, Uchytilová, et al., 1980 | AC |
38.8 ± 0.1 | 358. | C | Svoboda, Uchytilová, et al., 1980 | AC |
Enthalpy of vaporization
ΔvapH =
A exp(-βTr) (1 − Tr)β
ΔvapH =
Enthalpy of vaporization (at saturation pressure)
(kJ/mol)
Tr = reduced temperature (T / Tc)
View plot Requires a JavaScript / HTML 5 canvas capable browser.
Temperature (K) | A (kJ/mol) | β | Tc (K) | Reference | Comment |
---|---|---|---|---|---|
313. to 358. | 66.01 | 0.337 | 578. | Majer and Svoboda, 1985 |
Antoine Equation Parameters
log10(P) = A − (B / (T + C))
P = vapor pressure (bar)
T = temperature (K)
View plot Requires a JavaScript / HTML 5 canvas capable browser.
Temperature (K) | A | B | C | Reference | Comment |
---|---|---|---|---|---|
258.9 to 395.6 | 4.56197 | 1607.568 | -42.738 | Stull, 1947 | Coefficents calculated by NIST from author's data. |

Henry's Law data

Data compiled by: Rolf Sander
Henry's Law constant (water solution)
kH(T) = k°H exp(d(ln(kH))/d(1/T) ((1/T) - 1/(298.15 K)))
k°H = Henry's law constant for solubility in water at 298.15 K (mol/(kg*bar))
d(ln(kH))/d(1/T) = Temperature dependence constant (K)
k°H (mol/(kg*bar)) | d(ln(kH))/d(1/T) (K) | Method | Reference |
---|---|---|---|
2.6 | V | N/A |

Gas phase ion energetics data

Data compiled by: Sharon G. Lias, Rhoda D. Levin, and Sherif A. Kafafi
Ionization energy determinations
IE (eV) | Method | Reference | Comment |
---|---|---|---|
9.96 | PE | Benoit and Harrison, 1977 | Vertical value |

Van Den Dool and Kratz RI, non-polar column, temperature ramp

Data compiled by: NIST Mass Spectrometry Data Center, William E. Wallace, director

Column type CapillaryCapillary
Active phase DB-1SE-52
Column length (m) 30.150.
Carrier gas HeHe
Substrate
Column diameter (mm) 0.250.6
Phase thickness (μm) 0.25
Tstart (C) 40.10.
Tend (C) 325.200.
Heat rate (K/min) 3.1.
Initial hold (min)
Final hold (min)
I 792.4814.
ReferenceSun and Stremple, 2003de Pooter, Montens, et al., 1983
Comment MSDC-RI MSDC-RI

Kovats' RI, non-polar column, isothermal

Data compiled by: NIST Mass Spectrometry Data Center, William E. Wallace, director

Column type CapillaryCapillaryCapillaryCapillaryCapillary
Active phase OV-1DB-1DB-5SE-30SE-30
Column length (m)  30.60.25.25.
Carrier gas  N2N2
Substrate
Column diameter (mm)  0.2560.3210.330.33
Phase thickness (μm)  0.250.25
Temperature (C) 333.80.80.100.120.
I 792.6778.99800.795.785.
ReferenceHu, Lu, et al., 2006Mijin and Antonovic, 2006Mijin and Antonovic, 2006Haken and Korhonen, 1985Haken and Korhonen, 1985
Comment MSDC-RI MSDC-RI MSDC-RI MSDC-RI MSDC-RI
Column type CapillaryCapillaryCapillaryCapillaryPacked
Active phase SE-30OV-101OV-101OV-101Apiezon L
Column length (m) 25.19.15.15.
Carrier gas  N2
Substrate     Celite 545
Column diameter (mm) 0.330.280.220.22
Phase thickness (μm)
Temperature (C) 80.100.80.80.120.
I 807.794.792.792.752.
ReferenceHaken and Korhonen, 1985Horna, Táborský, et al., 1985Komárek, Hornová, et al., 1983Komárek, Hornová, et al., 1983, 2Bogoslovsky, Anvaer, et al., 1978
Comment MSDC-RI MSDC-RI MSDC-RI MSDC-RI MSDC-RI
Column type PackedPackedPackedPackedPacked
Active phase Apiezon LApiezon LSE-30SE-30SE-30
Column length (m)   3.73.2.
Carrier gas    N2
Substrate Celite 545 Celaton (62-72 mesh)Chromosorb W AW (60-80 mesh)Chromosorb W
Column diameter (mm)
Phase thickness (μm)
Temperature (C) 160.70.150.100.100.
I 759.752.789.797.792.
ReferenceBogoslovsky, Anvaer, et al., 1978Bogoslovsky, Anvaer, et al., 1978Ashes and Haken, 1974Chastrette, Heintz, et al., 1974Zarazir, Chovin, et al., 1970
Comment MSDC-RI MSDC-RI MSDC-RI MSDC-RI MSDC-RI
Column type PackedPackedPacked
Active phase SE-30Apiezon LApiezon L
Column length (m) 3.72.252.25
Carrier gas
Substrate Celite 560CeliteCelite
Column diameter (mm)
Phase thickness (μm)
Temperature (C) 150.130.70.
I 787.751.752.
ReferenceGermaine and Haken, 1969Wehrli and Kováts, 1959Wehrli and Kováts, 1959
Comment MSDC-RI MSDC-RI MSDC-RI

Normal alkane RI, non-polar column, custom temperature program

Data compiled by: NIST Mass Spectrometry Data Center, William E. Wallace, director

Column type CapillaryCapillaryCapillaryCapillaryCapillary
Active phase BPX-5VB-5SE-30HP-5SE-30
Column length (m) 30.60. 60.
Carrier gas HeliumHe
Substrate
Column diameter (mm) 0.250.25 0.32
Phase thickness (μm) 0.251. 1.
Program 70 0C (1 min) 3 0C/min -> 142 0C 5 0C/min -> 225 0C (10 min)35C(1min) => 4C/min => 175C => 10C/min => 260Cnot specifiednot specifiednot specified
I 809.807.789.801.785.
ReferenceOrtiz, Echeverra, et al., 2009Karlshøj, Nielsen, et al., 2007Liu, Liang, et al., 2007Thierry, Maillard, et al., 2005Vinogradov, 2004
Comment MSDC-RI MSDC-RI MSDC-RI MSDC-RI MSDC-RI
Column type CapillaryCapillaryCapillary
Active phase HP-5MSMethyl SiliconeMethyl Silicone
Column length (m) 30.
Carrier gas He
Substrate
Column diameter (mm) 0.25
Phase thickness (μm) 0.25
Program 40C (10min) => 3C/min => 120C => 10C/min => 250C (5min)not specifiednot specified
I 810.789.793.
ReferenceAnsorena, Gimeno, et al., 2001N/AEstrada and Gutierrez, 1999
Comment MSDC-RI MSDC-RI MSDC-RI

Normal alkane RI, non-polar column, temperature ramp

Data compiled by: NIST Mass Spectrometry Data Center, William E. Wallace, director

Column type CapillaryCapillaryCapillaryPacked
Active phase OV-101HP-5OV-101Apiezon L
Column length (m) 25.30.50.2.
Carrier gas NitrogenHe
Substrate    Chromosorb G-AW-DMCS
Column diameter (mm) 0.200.250.28
Phase thickness (μm) 0.250.25
Tstart (C) 40.35.80.25.
Tend (C) 220.200.200.
Heat rate (K/min) 6.3.2.10.
Initial hold (min)  5.
Final hold (min)
I 802.811.785.814.
ReferenceZenkevich, Eliseenkov, et al., 2011Isidorov, Purzynska, et al., 2006Anker, Jurs, et al., 1990Dahlmann, Köser, et al., 1979
Comment MSDC-RI MSDC-RI MSDC-RI MSDC-RI

Van Den Dool and Kratz RI, polar column, custom temperature program

Data compiled by: NIST Mass Spectrometry Data Center, William E. Wallace, director

Column type Capillary
Active phase Supelcowax-10
Column length (m) 30.
Carrier gas He
Substrate
Column diameter (mm) 0.25
Phase thickness (μm) 0.25
Program 35C(8min) => 4C/min => 60C => 6C/min => 160C => 20C/min => 200C(1min)
I 1056.
ReferenceBianchi, Careri, et al., 2007
Comment MSDC-RI

Kovats' RI, non-polar column, temperature ramp

Data compiled by: NIST Mass Spectrometry Data Center, William E. Wallace, director

Column type CapillaryCapillary
Active phase DB-1DB-1
Column length (m) 60.60.
Carrier gas HeHe
Substrate
Column diameter (mm) 0.320.32
Phase thickness (μm) 0.250.25
Tstart (C) 30.30.
Tend (C) 210.210.
Heat rate (K/min) 2.2.
Initial hold (min) 4.4.
Final hold (min)
I 796.796.
ReferenceTakeoka, Flath, et al., 1990Takeoka, Flath, et al., 1990
Comment MSDC-RI MSDC-RI

Kovats' RI, non-polar column, custom temperature program

Data compiled by: NIST Mass Spectrometry Data Center, William E. Wallace, director

Column type Capillary
Active phase SE-30
Column length (m)
Carrier gas
Substrate
Column diameter (mm)
Phase thickness (μm)
Program not specified
I 789.
ReferenceChretien and Dubois, 1978
Comment MSDC-RI

References

Schjanberg, 1935
Schjanberg, E.,
Die Verbrennungswarmen und die Refraktionsdaten einiger chlorsubstituierter Fettsauren und Ester.,
Z. Phys. Chem. Abt. A, 1935, 172, 197-233. [all data]
Zabransky, Hynek, et al., 1987
Zabransky, M.; Hynek, V.; Finkeova-Hastabova, J.; Vesely, F.,
Heat capacities of six liquid esters as a function of temperature,
Coll. Czech. Chem. Comm., 1987, 52, 251-256. [all data]
Jimenez, Romani, et al., 1986
Jimenez, E.; Romani, L.; Paz Andrade, M.I.; Roux-Desgranges, G.; Grolier, J.-P.E.,
Molar excess heat capacities and volumes for mixtures of alkanoates with cyclohexane at 25°C,
J. Solution Chem., 1986, 15(11), 879-890. [all data]
Timmermans, 1922
Timmermans, J.,
Investigation of the Freezing Point of Organic Substances VII,
Bull. Soc. Chim. Belg., 1922, 31, 389. [all data]
Young, 1994
Young, C.L.,
Personal Commun. 1994 1994, 1994. [all data]
Quadri and Kudchadker, 1991
Quadri, S.K.; Kudchadker, A.P.,
Measurement of the critical temperatures and critical pressures of some thermally stable or mildly unstable esters, ketones, and ethers,
J. Chem. Thermodyn., 1991, 23, 129-34. [all data]
Majer and Svoboda, 1985
Majer, V.; Svoboda, V.,
Enthalpies of Vaporization of Organic Compounds: A Critical Review and Data Compilation, Blackwell Scientific Publications, Oxford, 1985, 300. [all data]
De Heen, 1888
De Heen, P.,
Research on Physics and Theory of Liquids, Experimental Part Paris, 1888. [all data]
Pawlewski, 1882
Pawlewski, B.,
The critical temperatures of ester compounds,
Ber. Dtsch. Chem. Ges., 1882, 15, 2460-4. [all data]
Mathews, 1926
Mathews, J.H.,
The accurate measurement of heats of vaporization of liquids,
J. Am. Chem. Soc., 1926, 48, 562-576. [all data]
Ortega and Galvan, 1994
Ortega, Juan; Galvan, Salvador,
Vapor-Liquid Equilibria of Propyl Propanoate with 1-Alkanols at 101.32 kPa of Pressure,
J. Chem. Eng. Data, 1994, 39, 4, 907-910, https://doi.org/10.1021/je00016a061
. [all data]
Fárková and Wichterle, 1993
Fárková, J.; Wichterle, I.,
Vapour pressures of some ethyl and propyl esters of fatty acids,
Fluid Phase Equilibria, 1993, 90, 1, 143-148, https://doi.org/10.1016/0378-3812(93)85009-B
. [all data]
Stephenson and Malanowski, 1987
Stephenson, Richard M.; Malanowski, Stanislaw,
Handbook of the Thermodynamics of Organic Compounds, 1987, https://doi.org/10.1007/978-94-009-3173-2
. [all data]
Stull, 1947
Stull, Daniel R.,
Vapor Pressure of Pure Substances. Organic and Inorganic Compounds,
Ind. Eng. Chem., 1947, 39, 4, 517-540, https://doi.org/10.1021/ie50448a022
. [all data]
Svoboda, Uchytilová, et al., 1980
Svoboda, Václav; Uchytilová, Vera; Majer, Vladimír; Pick, Jirí,
Heats of vaporization of alkyl esters of formic, acetic and propionic acids,
Collect. Czech. Chem. Commun., 1980, 45, 12, 3233-3240, https://doi.org/10.1135/cccc19803233
. [all data]
Benoit and Harrison, 1977
Benoit, F.M.; Harrison, A.G.,
Predictive value of proton affinity. Ionization energy correlations involving oxygenated molecules,
J. Am. Chem. Soc., 1977, 99, 3980. [all data]