Butanoic acid, 3-methylbutyl ester
- Formula: C9H18O2
- Molecular weight: 158.2380
- IUPAC Standard InChIKey: PQLMXFQTAMDXIZ-UHFFFAOYSA-N
- CAS Registry Number: 106-27-4
- Chemical structure:
View 3d structure (requires JavaScript / HTML 5) - Other names: Butyric acid, isopentyl ester; Isoamyl butanoate; Isoamyl butylate; Isoamyl butyrate; Isopentyl butyrate; 3-Methylbutyl butyrate; Isopentyl butanoate; Isoamyl-n-butyrate; UN 2620; 3-Methyl-1-butyl butanoate; 3-Methylbutyl butanoate; Isopentyl-n-butyrate; 3-Methylbutyl n-butyrate; Isopentyl alcohol, butyrate

Condensed phase thermochemistry data

Data compiled by: Hussein Y. Afeefy, Joel F. Liebman, and Stephen E. Stein
Quantity | Value | Units | Method | Reference | Comment |
---|---|---|---|---|---|
ΔcH°liquid | -5491.1 | kJ/mol | Ccb | Schjanberg, 1935 | Corresponding ΔfHºliquid = -623.0 kJ/mol (simple calculation by NIST; no Washburn corrections) |

Phase change data

Data compiled as indicated in comments:
BS - Robert L. Brown and Stephen E. Stein
TRC - Thermodynamics Research Center, NIST Boulder Laboratories, Chris Muzny director
AC - William E. Acree, Jr., James S. Chickos
Quantity | Value | Units | Method | Reference | Comment |
---|---|---|---|---|---|
Tboil | 451. ± 7. | K | AVG | N/A | Average of 7 values; Individual data points |
Quantity | Value | Units | Method | Reference | Comment |
Tc | 618.83 | K | N/A | Brown, 1906 | Uncertainty assigned by TRC = 6. K; TRC |
Enthalpy of vaporization
ΔvapH (kJ/mol) | Temperature (K) | Method | Reference | Comment |
---|---|---|---|---|
47.4 | 309. | A | Stephenson and Malanowski, 1987 | Based on data from 294. to 452. K. See also Stull, 1947.; AC |
Antoine Equation Parameters
log10(P) = A − (B / (T + C))
P = vapor pressure (bar)
T = temperature (K)
View plot Requires a JavaScript / HTML 5 canvas capable browser.
Temperature (K) | A | B | C | Reference | Comment |
---|---|---|---|---|---|
294.4 to 451.8 | 4.64876 | 1910.84 | -40.296 | Stull, 1947 | Coefficents calculated by NIST from author's data. |

Normal alkane RI, non-polar column, temperature ramp

Data compiled by: NIST Mass Spectrometry Data Center, William E. Wallace, director

Column type CapillaryCapillaryCapillaryCapillaryCapillary
Active phase HP-5DB-5HP-5 MSDB-1DB-5
Column length (m) 25.30.30.30.30.
Carrier gas HeliumNitrogenHeliumHeHe
Substrate
Column diameter (mm) 0.200.250.25 0.32
Phase thickness (μm) 0.330.250.250.250.25
Tstart (C) 60.40.50.50.40.
Tend (C) 240.230.230.220.250.
Heat rate (K/min) 3.2.4.6.4.
Initial hold (min)   4.2.2.
Final hold (min) 7. 10.20.15.
I 1068.1058.1058.1042.1056.
ReferenceMaridass, 2009Scrivanti, Anton, et al., 2009Forero, Quijano, et al., 2008Audino, Alzogaray, et al., 2007Fan and Qian, 2006
Comment MSDC-RI MSDC-RI MSDC-RI MSDC-RI MSDC-RI
Column type CapillaryCapillaryCapillaryCapillaryCapillary
Active phase DB-5HP-5HP-5DB-5HP-5
Column length (m) 30.30.25.30.25.
Carrier gas HeH2HeN2He
Substrate
Column diameter (mm) 0.320.250.20.320.2
Phase thickness (μm) 1.0.250.330.250.33
Tstart (C) 40.50.60.40.40.
Tend (C) 250.280.240.250.190.
Heat rate (K/min) 4.4.3.4.4.
Initial hold (min) 2.2. 2.
Final hold (min) 15.10.7.5.5.
I 1056.1060.1068.1056.1039.
ReferenceFan and Qian, 2006Pino, Sauri-Duch, et al., 2006Duarte, Figueira, et al., 2005Fan and Qian, 2005Azodanlou, Darbellay, et al., 2003
Comment MSDC-RI MSDC-RI MSDC-RI MSDC-RI MSDC-RI
Column type CapillaryCapillaryCapillaryCapillaryCapillary
Active phase SPB-5DB-5DB-5DB-5HP-5
Column length (m) 30.30.30.25.30.
Carrier gas HeH2HeN2N2
Substrate
Column diameter (mm) 0.320.250.250.250.25
Phase thickness (μm) 0.250.250.250.250.25
Tstart (C) 40.60.60.50.60.
Tend (C) 220.280.240.250.220.
Heat rate (K/min) 5.4.3.4.5.
Initial hold (min) 1.10.  10.
Final hold (min) 20.40. 10.
I 1062.1060.1008.1060.1013.
ReferenceLedauphin, Guichard, et al., 2003Pino, Marbot, et al., 2003da Silva, Luz, et al., 2003Zrira, Elamrani, et al., 2003Gallori, Flamini, et al., 2001
Comment MSDC-RI MSDC-RI MSDC-RI MSDC-RI MSDC-RI
Column type CapillaryCapillaryCapillaryCapillaryCapillary
Active phase OV-101DB-1DB-1BP-1SE-30
Column length (m) 50.30.30.25.
Carrier gas HeHeHe Helium
Substrate
Column diameter (mm) 0.220.250.250.33
Phase thickness (μm) 1.0.250.25
Tstart (C) 100.50.50.45.70.
Tend (C) 220.240.240.180.170.
Heat rate (K/min) 1.3.3.3.2.
Initial hold (min) 1.5.5.3.
Final hold (min)
I 1042.1038.1039.1042.1040.
ReferenceCamciuc, Bessière, et al., 1998Shiota, 1993Shiota, 1993Wyllie, Brophy, et al., 1990Alves and Jennings, 1979
Comment MSDC-RI MSDC-RI MSDC-RI MSDC-RI MSDC-RI

Normal alkane RI, polar column, temperature ramp

Data compiled by: NIST Mass Spectrometry Data Center, William E. Wallace, director

Column type CapillaryCapillaryCapillaryCapillaryCapillary
Active phase CP-Wax CBCP-Wax 52CBDB-WaxDB-WaxDB-Wax
Column length (m) 30.30.30.30.30.
Carrier gas HeliumHeHeHeN2
Substrate
Column diameter (mm) 0.25 0.250.320.32
Phase thickness (μm) 0.250.320.250.250.25
Tstart (C) 50.50.40.40.40.
Tend (C) 150.220.230.230.230.
Heat rate (K/min) 2.6.4.4.4.
Initial hold (min)  2.2.2.2.
Final hold (min) 5.20.15.15.5.
I 1266.1283.1255.1255.1266.
ReferenceAlves, da Penha, et al., 2012Audino, Alzogaray, et al., 2007Fan and Qian, 2006Fan and Qian, 2006Fan and Qian, 2005
Comment MSDC-RI MSDC-RI MSDC-RI MSDC-RI MSDC-RI
Column type CapillaryCapillaryCapillary
Active phase FFAPDB-WaxDB-Wax
Column length (m) 30.60.30.
Carrier gas H2H2
Substrate
Column diameter (mm) 0.320.320.32
Phase thickness (μm) 0.250.25
Tstart (C) 40.60.70.
Tend (C) 240.220.200.
Heat rate (K/min) 3.3.4.
Initial hold (min) 5. 2.
Final hold (min)
I 1262.1263.1287.
ReferenceDucruet, Fournier, et al., 2001Werkhoff, Güntert, et al., 1998Wyllie, Brophy, et al., 1990
Comment MSDC-RI MSDC-RI MSDC-RI

Van Den Dool and Kratz RI, non-polar column, custom temperature program

Data compiled by: NIST Mass Spectrometry Data Center, William E. Wallace, director

Column type CapillaryCapillary
Active phase DB-5HP-5
Column length (m) 30.30.
Carrier gas HeHe
Substrate
Column diameter (mm) 0.250.25
Phase thickness (μm) 0.250.25
Program 50C (1min) => 5C/min => 100C => 10C/min => 250C (9min)50C => 6C/min => 100C => 4C/min => 280C
I 1056.1060.
ReferenceBeaulieu and Grimm, 2001Isidorov, Krajewska, et al., 2001
Comment MSDC-RI MSDC-RI

References

Schjanberg, 1935
Schjanberg, E.,
Die Verbrennungswarmen und die Refraktionsdaten einiger chlorsubstituierter Fettsauren und Ester.,
Z. Phys. Chem. Abt. A, 1935, 172, 197-233. [all data]
Brown, 1906
Brown, J.C.,
The critical temperature and value of ml/theta of some carbon compounds,
J. Chem. Soc., Trans., 1906, 89, 311. [all data]
Stephenson and Malanowski, 1987
Stephenson, Richard M.; Malanowski, Stanislaw,
Handbook of the Thermodynamics of Organic Compounds, 1987, https://doi.org/10.1007/978-94-009-3173-2
. [all data]
Stull, 1947
Stull, Daniel R.,
Vapor Pressure of Pure Substances. Organic and Inorganic Compounds,
Ind. Eng. Chem., 1947, 39, 4, 517-540, https://doi.org/10.1021/ie50448a022
. [all data]