Cyclopentenyl radical
- Formula: C5H7
- Molecular weight: 67.1091
- IUPAC Standard InChIKey: MNLVCBKWEVXHGE-UHFFFAOYSA-N
- CAS Registry Number: 10577-65-8
- Chemical structure:
View 3d structure (requires JavaScript / HTML 5) - Permanent link for this species. Use this link for bookmarking this species for future reference.

Gas phase ion energetics data

Data compiled by: Sharon G. Lias, Rhoda D. Levin, and Sherif A. Kafafi
Ionization energy determinations
IE (eV) | Method | Reference |
---|---|---|
7.00 | EI | Lossing and Traeger, 1975 |

References

Lossing and Traeger, 1975
Lossing, F.P.; Traeger, J.C.,
Stabilization in cyclopentadienyl, cyclopentenyl, and cyclopentyl cations,
J. Am. Chem. Soc., 1975, 97, 1579. [all data]