Hex-4-yn-3-one
- Formula: C6H8O
- Molecular weight: 96.1271
- IUPAC Standard InChIKey: BIWUZTZFFUMZIG-UHFFFAOYSA-N
- CAS Registry Number: 10575-41-4
- Chemical structure:
View 3d structure (requires JavaScript / HTML 5) - Other names: 4-Hexyne-3-one; 4-Hexyn-3-one

Gas phase ion energetics data

Data compiled by: Sharon G. Lias, Rhoda D. Levin, and Sherif A. Kafafi
Ionization energy determinations
IE (eV) | Method | Reference | Comment |
---|---|---|---|
9.62 | PE | Carlier and Mouvier, 1979 | Vertical value |

References

Carlier and Mouvier, 1979
Carlier, P.; Mouvier, G.,
Etude par spectrometrie de photoelectrons de la structure electronique des ynals et des ynones conjugues,
J. Electron Spectrosc. Relat. Phenom., 1979, 17, 169. [all data]