1-Butanol, 3-methyl-, propanoate
- Formula: C8H16O2
- Molecular weight: 144.2114
- IUPAC Standard InChIKey: XAOGXQMKWQFZEM-UHFFFAOYSA-N
- CAS Registry Number: 105-68-0
- Chemical structure:
View 3d structure (requires JavaScript / HTML 5) - Other names: Isopentyl alcohol, propionate; Isoamyl propionate; Isopentyl propionate; 3-Methylbutyl propionate; Isoamyl propanoate; Isopentyl propanoate; Propionic acid, isopentyl ester; 3-Methylbutyl propanoate; iso-Amyl n-propionate; 3-Methyl-1-butyl propanoate; 1-Butanol, 3-methyl-, 1-propanoate; NSC 7932

Condensed phase thermochemistry data

Data compiled by: Eugene S. Domalski and Elizabeth D. Hearing
Constant pressure heat capacity of liquid
Cp,liquid (J/mol*K) | Temperature (K) | Reference | Comment |
---|---|---|---|
285.2 | 298.15 | Guseinov, Shubin, et al., 1984 | T = 205 to 348 K. Unsmoothed experimental datum. Interpolated to 298.15 K. |

Phase change data

Data compiled as indicated in comments:
BS - Robert L. Brown and Stephen E. Stein
TRC - Thermodynamics Research Center, NIST Boulder Laboratories, Chris Muzny director
Quantity | Value | Units | Method | Reference | Comment |
---|---|---|---|---|---|
Tboil | 433.9 | K | N/A | Weast and Grasselli, 1989 | BS |
Tboil | 433.85 | K | N/A | Lecat, 1943 | Uncertainty assigned by TRC = 0.25 K; TRC |
Tboil | 433.45 | K | N/A | Lecat, 1927 | Uncertainty assigned by TRC = 1. K; TRC |
Tboil | 433.5 | K | N/A | Lecat, 1927, 2 | Uncertainty assigned by TRC = 0.5 K; TRC |
Tboil | 431.65 | K | N/A | Munch, 1926 | Uncertainty assigned by TRC = 1. K; TRC |
Quantity | Value | Units | Method | Reference | Comment |
Tc | 611.39 | K | N/A | Brown, 1906 | Uncertainty assigned by TRC = 6. K; TRC |

Van Den Dool and Kratz RI, polar column, temperature ramp

Data compiled by: NIST Mass Spectrometry Data Center, William E. Wallace, director

Column type Capillary
Active phase ZB-Wax
Column length (m) 30.
Carrier gas He
Substrate
Column diameter (mm) 0.25
Phase thickness (μm) 0.15
Tstart (C) 35.
Tend (C) 220.
Heat rate (K/min) 5.
Initial hold (min) 5.
Final hold (min) 10.
I 1183.
ReferenceLedauphin, Saint-Clair, et al., 2004
Comment MSDC-RI

Normal alkane RI, polar column, custom temperature program

Data compiled by: NIST Mass Spectrometry Data Center, William E. Wallace, director

Column type Capillary
Active phase Carbowax 20M
Column length (m)
Carrier gas
Substrate
Column diameter (mm)
Phase thickness (μm)
Program not specified
I 1180.
ReferenceVinogradov, 2004
Comment MSDC-RI

Kovats' RI, non-polar column, isothermal

View large format table.

Column type Active phase Temperature (C) I Reference Comment
CapillarySE-30100.947.Haken and Korhonen, 1985Column length: 25. m; Column diameter: 0.33 mm
CapillarySE-30120.937.Haken and Korhonen, 1985Column length: 25. m; Column diameter: 0.33 mm
CapillarySE-30140.958.Haken and Korhonen, 1985Column length: 25. m; Column diameter: 0.33 mm
CapillarySE-3060.961.Haken and Korhonen, 1985Column length: 25. m; Column diameter: 0.33 mm
CapillarySE-3080.950.Haken and Korhonen, 1985Column length: 25. m; Column diameter: 0.33 mm
CapillaryOV-101100.955.Horna, Táborský, et al., 1985N2; Column length: 19. m; Column diameter: 0.28 mm
CapillaryOV-10180.953.Komárek, Hornová, et al., 1983Column length: 15. m; Column diameter: 0.22 mm
PackedApiezon L160.926.Bogoslovsky, Anvaer, et al., 1978Celite 545
PackedSE-30150.948.Ashes and Haken, 1974Celaton (62-72 mesh); Column length: 3.7 m
PackedSE-30100.954.Zarazir, Chovin, et al., 1970Chromosorb W; Column length: 2. m
PackedSE-30150.955.Germaine and Haken, 1969Celite 560; Column length: 3.7 m

Kovats' RI, non-polar column, custom temperature program

View large format table.

Column type Active phase I Reference Comment
CapillarySE-30948.Chretien and Dubois, 1978Program: not specified

Kovats' RI, polar column, isothermal

View large format table.

Column type Active phase Temperature (C) I Reference Comment
CapillaryOV-351100.1206.Haken and Korhonen, 1985N2; Column length: 25. m; Column diameter: 0.32 mm
CapillaryOV-351120.1238.Haken and Korhonen, 1985N2; Column length: 25. m; Column diameter: 0.32 mm
CapillaryOV-35160.1198.Haken and Korhonen, 1985N2; Column length: 25. m; Column diameter: 0.32 mm
CapillaryOV-35180.1196.Haken and Korhonen, 1985N2; Column length: 25. m; Column diameter: 0.32 mm
CapillarySP-1000100.1186.Horna, Táborský, et al., 1985N2; Column length: 46. m; Column diameter: 0.23 mm
PackedCarbowax 20M100.1200.Zarazir, Chovin, et al., 1970Chromosorb W; Column length: 2. m

Kovats' RI, polar column, temperature ramp

View large format table.

Column type Active phase I Reference Comment
CapillaryCarbowax 20M1184.Tressl, Friese, et al., 1978He, 2. K/min; Column length: 50. m; Column diameter: 0.28 mm; Tstart: 70. C; Tend: 190. C

Van Den Dool and Kratz RI, non-polar column, temperature ramp

View large format table.

Column type Active phase I Reference Comment
CapillaryCP Sil 5 CB948.Pino, Marbot, et al., 200225. m/0.25 mm/0.25 μm, N2, 60. C @ 6. min, 4. K/min; Tend: 280. C
CapillaryDB-5969.Isidorov, Zenkevich, et al., 2001He, 3. K/min; Column length: 30. m; Column diameter: 0.25 mm; Tstart: 50. C; Tend: 250. C
CapillaryDB-1950.DeMilo, Lee, et al., 199630. m/0.248 mm/0.25 μm, He, 50. C @ 5. min, 5. K/min; Tend: 250. C
CapillaryDB-1950.DeMilo, Lee, et al., 199630. m/0.248 mm/0.25 μm, He, 50. C @ 5. min, 5. K/min; Tend: 250. C

Van Den Dool and Kratz RI, non-polar column, custom temperature program

View large format table.

Column type Active phase I Reference Comment
CapillaryHP-5969.Isidorov, Krajewska, et al., 200130. m/0.25 mm/0.25 μm, He; Program: 50C => 6C/min => 100C => 4C/min => 280C
CapillaryDB-1949.Eri, Khoo, et al., 200060. m/0.25 mm/0.25 μm, He; Program: -20C (5min) => 10C/min => 100C => 4C/min => 200C => 10C/min => 280C

Van Den Dool and Kratz RI, polar column, custom temperature program

View large format table.

Column type Active phase I Reference Comment
CapillarySupelcowax-101192.Bianchi, Careri, et al., 200730. m/0.25 mm/0.25 μm, He; Program: 35C(8min) => 4C/min => 60C => 6C/min => 160C => 20C/min => 200C(1min)

Normal alkane RI, non-polar column, temperature ramp

View large format table.

Column type Active phase I Reference Comment
CapillaryHP-5 MS972.Lazarevic, Radulovic, et al., 201030. m/0.25 mm/0.25 μm, Helium, 5. K/min; Tstart: 70. C; Tend: 290. C
CapillaryZB-1952.Mierendorff, Stahl-Biskup, et al., 200830. m/0.25 mm/0.25 μm, Nitrogen, 3. K/min; Tstart: 45. C; Tend: 230. C
CapillaryDB-1952.Audino, Alzogaray, et al., 2007He, 50. C @ 2. min, 6. K/min, 220. C @ 20. min; Column length: 30. m; Phase thickness: 0.25 μm
CapillaryRTX-5Sil974.Holland, Larkov, et al., 200530. m/0.25 mm/0.25 μm, He, 45. C @ 5. min, 3. K/min; Tend: 200. C
CapillaryHP-5973.9Leffingwell and Alford, 200560. m/0.32 mm/0.25 μm, He, 30. C @ 2. min, 2. K/min, 260. C @ 28. min
CapillarySPB-5972.Ledauphin, Guichard, et al., 200330. m/0.32 mm/0.25 μm, He, 40. C @ 1. min, 5. K/min, 220. C @ 20. min
CapillaryZB-1952.Mierendorff, Stahl-Biskup, et al., 200330. m/0.25 mm/0.25 μm, N2, 3. K/min; Tstart: 45. C; Tend: 230. C
CapillaryOV-101954.Camciuc, Bessière, et al., 199850. m/0.22 mm/1. μm, He, 100. C @ 1. min, 1. K/min; Tend: 220. C
CapillaryOV-101954.Anker, Jurs, et al., 19902. K/min; Column length: 50. m; Column diameter: 0.28 mm; Tstart: 80. C; Tend: 200. C

Normal alkane RI, non-polar column, custom temperature program

View large format table.

Column type Active phase I Reference Comment
CapillaryPolydimethyl siloxane with 5 % Ph groups969.Robinson, Adams, et al., 2012Program: not specified
CapillaryPolydimethyl siloxane with 5 % Ph groups971.Robinson, Adams, et al., 2012Program: not specified
CapillaryHP-5 MS975.Nance and Setzer, 201130. m/0.25 mm/0.25 μm, Helium; Program: 40 0C (10 min) 3 0C/min -> 200 0C 2 0C/min -> 220 0C
CapillaryVB-5960.Karlshøj, Nielsen, et al., 200760. m/0.25 mm/1. μm, He; Program: 35C(1min) => 4C/min => 175C => 10C/min => 260C
CapillarySE-30948.Liu, Liang, et al., 2007Program: not specified
CapillaryHP-5966.Splivallo, Bossi, et al., 2007He; Program: 50C => 3C/min => 200C(10min) => 10C/min => 290C(10min)
CapillaryHP-5958.Thierry, Maillard, et al., 200560. m/0.32 mm/1. μm; Program: not specified
CapillarySE-30954.Vinogradov, 2004Program: not specified

Normal alkane RI, polar column, temperature ramp

View large format table.

Column type Active phase I Reference Comment
CapillaryCP-Wax 52CB1176.Audino, Alzogaray, et al., 2007He, 50. C @ 2. min, 6. K/min, 220. C @ 20. min; Column length: 30. m; Phase thickness: 0.32 μm
CapillaryCP Wax 52 CB1181.Chen, Chyau, et al., 200760. m/0.25 mm/0.25 μm, Helium, 3. K/min; Tstart: 40. C; Tend: 220. C
CapillarySupelcowax-101176.Chin, Nazimah, et al., 200710. m/0.1 mm/0.1 μm, He, 40. C @ 1.5 min, 50. K/min, 240. C @ 2. min
CapillaryDB-Wax1188.Umano, Hagi, et al., 200060. m/0.25 mm/0.25 μm, He, 40. C @ 2. min, 2. K/min; Tend: 200. C
CapillaryCarbowax 20M1180.Anker, Jurs, et al., 19902. K/min; Column length: 80. m; Column diameter: 0.2 mm; Tstart: 70. C; Tend: 170. C

References

Guseinov, Shubin, et al., 1984
Guseinov, K.D.; Shubin, V.V.; Klimova, T.F.,
Study of the enthalpy of liquid propionate esters, Izv. Vyssh. Uchebn. Zaved,
Neft. Gaz, 1984, 27(8), 54-57. [all data]
Weast and Grasselli, 1989
CRC Handbook of Data on Organic Compounds, 2nd Editon, Weast,R.C and Grasselli, J.G., ed(s)., CRC Press, Inc., Boca Raton, FL, 1989, 1. [all data]
Lecat, 1943
Lecat, M.,
Azeotropes of Ethyl Urethane and other Azeotropes,
C. R. Hebd. Seances Acad. Sci., 1943, 217, 273. [all data]
Lecat, 1927
Lecat, M.,
New binary azeotropes: 5th list,
Recl. Trav. Chim. Pays-Bas, 1927, 46, 240-7. [all data]
Lecat, 1927, 2
Lecat, M.,
New binary azeotropes: 6th list,
Ann. Soc. Sci. Bruxelles, Ser. B, 1927, 47, 63-71. [all data]
Munch, 1926
Munch, J.C.,
The Refractometric Determination of Alcohols and Esters in Aqueous and in Cottonseed Oil Solutions,
J. Am. Chem. Soc., 1926, 48, 994-1003. [all data]
Brown, 1906
Brown, J.C.,
The critical temperature and value of ml/theta of some carbon compounds,
J. Chem. Soc., Trans., 1906, 89, 311. [all data]