Phenol, 2,4-dimethyl-
- Formula: C8H10O
- Molecular weight: 122.1644
- IUPAC Standard InChIKey: KUFFULVDNCHOFZ-UHFFFAOYSA-N
- CAS Registry Number: 105-67-9
- Chemical structure:
View 3d structure (requires JavaScript / HTML 5) - Other names: 2,4-Xylenol; m-Xylenol; 1-Hydroxy-2,4-dimethylbenzene; 2,4-Dimethylphenol; 4-Hydroxy-1,3-dimethylbenzene; 4,6-Dimethylphenol; 1,3-Dimethyl-4-hydroxybenzene; Rcra waste number U101; NSC 3829; Gallex

Gas phase thermochemistry data

Data compiled as indicated in comments:
ALS - Hussein Y. Afeefy, Joel F. Liebman, and Stephen E. Stein
GT - Glushko Thermocenter, Russian Academy of Sciences, Moscow
Quantity | Value | Units | Method | Reference | Comment |
---|---|---|---|---|---|
ΔfH°gas | -163.0 ± 0.75 | kJ/mol | Ccb | Andon, Biddiscombe, et al., 1960 | ALS |
Constant pressure heat capacity of gas
Cp,gas (J/mol*K) | Temperature (K) | Reference | Comment |
---|---|---|---|
48.58 | 50. | Kudchadker S.A., 1979 | GT |
72.09 | 100. | ||
92.16 | 150. | ||
112.88 | 200. | ||
144.95 | 273.15 | ||
156.10 | 298.15 | ||
156.93 | 300. | ||
199.46 | 400. | ||
235.84 | 500. | ||
265.64 | 600. | ||
290.07 | 700. | ||
310.40 | 800. | ||
327.53 | 900. | ||
342.09 | 1000. | ||
354.55 | 1100. | ||
365.26 | 1200. | ||
374.49 | 1300. | ||
382.48 | 1400. | ||
389.42 | 1500. |

Condensed phase thermochemistry data

Data compiled by: Hussein Y. Afeefy, Joel F. Liebman, and Stephen E. Stein
Quantity | Value | Units | Method | Reference | Comment |
---|---|---|---|---|---|
ΔfH°liquid | -228.8 ± 1.4 | kJ/mol | Ccb | Andon, Biddiscombe, et al., 1960 | |
Quantity | Value | Units | Method | Reference | Comment |
ΔcH°liquid | -4348.47 ± 0.92 | kJ/mol | Ccb | Andon, Biddiscombe, et al., 1960 | Corresponding ΔfHºliquid = -228.7 kJ/mol (simple calculation by NIST; no Washburn corrections) |

Phase change data

Data compiled as indicated in comments:
BS - Robert L. Brown and Stephen E. Stein
TRC - Thermodynamics Research Center, NIST Boulder Laboratories, Chris Muzny director
DH - Eugene S. Domalski and Elizabeth D. Hearing
AC - William E. Acree, Jr., James S. Chickos
ALS - Hussein Y. Afeefy, Joel F. Liebman, and Stephen E. Stein
DRB - Donald R. Burgess, Jr.
Quantity | Value | Units | Method | Reference | Comment |
---|---|---|---|---|---|
Tboil | 484. ± 1. | K | AVG | N/A | Average of 9 values; Individual data points |
Quantity | Value | Units | Method | Reference | Comment |
Tfus | 298. ± 3. | K | AVG | N/A | Average of 13 values; Individual data points |
Quantity | Value | Units | Method | Reference | Comment |
Tc | 707.55 | K | N/A | Ambrose, 1963 | Uncertainty assigned by TRC = 0.3 K; TRC |
Tc | 818.15 | K | N/A | Glaser and Ruland, 1957 | Uncertainty assigned by TRC = 2. K; TRC |
Quantity | Value | Units | Method | Reference | Comment |
Pc | 101.325 | bar | N/A | Glaser and Ruland, 1957 | Uncertainty assigned by TRC = 0.005 bar; TRC |
Quantity | Value | Units | Method | Reference | Comment |
ΔvapH° | 64.96 | kJ/mol | N/A | Majer and Svoboda, 1985 | |
ΔvapH° | 64.6 | kJ/mol | CGC | Chickos, Hosseini, et al., 1995 | Based on data from 393. to 433. K.; AC |
ΔvapH° | 65.9 ± 0.2 | kJ/mol | V | Andon, Biddiscombe, et al., 1960 | ALS |
ΔvapH° | 65.8 | kJ/mol | N/A | Andon, Biddiscombe, et al., 1960 | DRB |
ΔvapH° | 48.53 | kJ/mol | C | Glaser and Ruland, 1957 | ALS |
Reduced pressure boiling point
Tboil (K) | Pressure (bar) | Reference | Comment |
---|---|---|---|
485.2 | 1.02 | Aldrich Chemical Company Inc., 1990 | BS |
Enthalpy of vaporization
ΔvapH (kJ/mol) | Temperature (K) | Method | Reference | Comment |
---|---|---|---|---|
65.9 | 297. | A | Stephenson and Malanowski, 1987 | Based on data from 282. to 318. K.; AC |
51.8 | 444. | A,GS,EB | Stephenson and Malanowski, 1987 | Based on data from 429. to 486. K. See also Andon, Biddiscombe, et al., 1960, 2.; AC |
65.9 ± 0.2 | 282. to 318. | GS | Andon, Biddiscombe, et al., 1960, 2 | See also Cox and Pilcher, 1970.; AC |
65.9 ± 0.2 | 282. to 318. | GS | Andon, Biddiscombe, et al., 1960, 2 | See also Cox and Pilcher, 1970.; AC |
Antoine Equation Parameters
log10(P) = A − (B / (T + C))
P = vapor pressure (bar)
T = temperature (K)
View plot Requires a JavaScript / HTML 5 canvas capable browser.
Temperature (K) | A | B | C | Reference | Comment |
---|---|---|---|---|---|
417.53 to 485.47 | 4.19167 | 1595.54 | -102.913 | Andon, Biddiscombe, et al., 1960 | Coefficents calculated by NIST from author's data. |
Enthalpy of sublimation
ΔsubH (kJ/mol) | Temperature (K) | Method | Reference | Comment |
---|---|---|---|---|
61.5 ± 0.8 | 310. | V | Wolf and Weghofer, 1938 | ALS |
Enthalpy of fusion
ΔfusH (kJ/mol) | Temperature (K) | Method | Reference | Comment |
---|---|---|---|---|
12.76 | 297.3 | DSC | Jamróz, Palczewska-Tulinska, et al., 1998 | AC |

Gas phase ion energetics data

Data compiled by: Sharon G. Lias, Rhoda D. Levin, and Sherif A. Kafafi
Ionization energy determinations
IE (eV) | Method | Reference | Comment |
---|---|---|---|
8.0 | PE | Kobayashi and Nagakura, 1974 | |
8.18 | PE | Kobayashi and Nagakura, 1974 | Vertical value |

Henry's Law data

Data compiled by: Rolf Sander
Henry's Law constant (water solution)
kH(T) = k°H exp(d(ln(kH))/d(1/T) ((1/T) - 1/(298.15 K)))
k°H = Henry's law constant for solubility in water at 298.15 K (mol/(kg*bar))
d(ln(kH))/d(1/T) = Temperature dependence constant (K)
k°H (mol/(kg*bar)) | d(ln(kH))/d(1/T) (K) | Method | Reference |
---|---|---|---|
0.19 | -3300. | X | N/A |
410. | 6600. | X | N/A |

Kovats' RI, non-polar column, isothermal

Data compiled by: NIST Mass Spectrometry Data Center, William E. Wallace, director

Column type CapillaryCapillaryCapillaryCapillaryCapillary
Active phase SE-30OV-1OV-1OV-1HP-1
Column length (m) 30.25.25.25.25.
Carrier gas HeN2N2N2N2
Substrate
Column diameter (mm) 0.250.20.20.20.20
Phase thickness (μm) 0.50.330.330.33
Temperature (C) 100.150.150.150.60.
I 1124.1126.1126.1127.1094.
ReferenceBerezkin, Popova, et al., 1997Zhang, Chen, et al., 1997Zhang, Chen, et al., 1997Zhang, Chen, et al., 1997Zhang, Li, et al., 1992
Comment MSDC-RI MSDC-RI MSDC-RI MSDC-RI MSDC-RI
Column type CapillaryCapillaryCapillaryCapillaryPacked
Active phase HP-1HP-1HP-1PS-255SE-30
Column length (m) 25.25.25.50.2.
Carrier gas N2N2N2
Substrate
Column diameter (mm) 0.200.200.200.30
Phase thickness (μm)    0.25
Temperature (C) 60.100.100.150.220.
I 1094.1130.1132.1128.1162.
ReferenceZhang, Li, et al., 1992Zhang, Li, et al., 1992Zhang, Li, et al., 1992Engewald, Billing, et al., 1988Sellier, Tersac, et al., 1981
Comment MSDC-RI MSDC-RI MSDC-RI MSDC-RI MSDC-RI
Column type Packed
Active phase Methyl Silicone
Column length (m)
Carrier gas
Substrate
Column diameter (mm)
Phase thickness (μm)
Temperature (C) 150.
I 1177.
ReferenceRadecki, Grzybowski, et al., 1979
Comment MSDC-RI

Lee's RI, non-polar column, temperature ramp

Data compiled by: NIST Mass Spectrometry Data Center, William E. Wallace, director

Column type CapillaryCapillaryCapillaryCapillary
Active phase DB-5DB-5DB-5DB-5
Column length (m) 25.30.30.30.
Carrier gas HeHeHeHe
Substrate
Column diameter (mm) 0.30.320.320.26
Phase thickness (μm)  0.250.250.25
Tstart (C) 60.40.40.50.
Tend (C) 270.285.285.300.
Heat rate (K/min) 5.8.8.6.
Initial hold (min) 2.3.3.4.
Final hold (min)  29.529.520.
I 192.24190.9191.2192.69
ReferenceWilliams and Horne, 1995Donnelly, Abdel-Hamid, et al., 1993Donnelly, Abdel-Hamid, et al., 1993Rostad and Pereira, 1986
Comment MSDC-RI MSDC-RI MSDC-RI MSDC-RI

Normal alkane RI, polar column, custom temperature program

Data compiled by: NIST Mass Spectrometry Data Center, William E. Wallace, director

Column type CapillaryCapillaryCapillary
Active phase DB-WaxDB-WaxCarbowax 20M
Column length (m) 60.60.
Carrier gas HeHe
Substrate
Column diameter (mm) 0.320.32
Phase thickness (μm) 0.250.25
Program 30C(4min) => 2C/min => 170C(25min) => 10C/min => 210C(10min)30C(4min) => 2C/min => 170C(25min) => 10C/min => 210C(10min)not specified
I 2070.2078.2127.
ReferenceLee, Lee, et al., 2005Lee, Lee, et al., 2005Zimmermann, Lauterbach, et al., 1985
Comment MSDC-RI MSDC-RI MSDC-RI

Kovats' RI, polar column, isothermal

Data compiled by: NIST Mass Spectrometry Data Center, William E. Wallace, director

Column type Packed
Active phase Carbowax 20M
Column length (m) 2.
Carrier gas
Substrate
Column diameter (mm)
Phase thickness (μm)
Temperature (C) 220.
I 2087.
ReferenceSellier, Tersac, et al., 1981
Comment MSDC-RI

References

Andon, Biddiscombe, et al., 1960
Andon, R.J.L.; Biddiscombe, D.P.; Cox, J.D.; Handley, R.; Harrop, D.; Herington, E.F.G.; Martin, J.F.,
Thermodynamic properties of organic oxygen compounds. Part I. Preparation and physical properties of pure phenol, cresols, and xylenols,
J. Chem. Soc., 1960, 5246-5254. [all data]
Kudchadker S.A., 1979
Kudchadker S.A.,
Property data available for coal chemicals,
Hydrocarbon Process., 1979, 58, 169-171. [all data]
Ambrose, 1963
Ambrose, D.,
Critical Temperatures of Some Phenols and Other Organic Compounds,
Trans. Faraday Soc., 1963, 59, 1988. [all data]
Glaser and Ruland, 1957
Glaser, F.; Ruland, H.,
Untersuchungsen über dampfdruckkurven und kritische daten einiger technisch wichtiger organischer substanzen,
Chem. Ing. Techn., 1957, 29, 772. [all data]
Majer and Svoboda, 1985
Majer, V.; Svoboda, V.,
Enthalpies of Vaporization of Organic Compounds: A Critical Review and Data Compilation, Blackwell Scientific Publications, Oxford, 1985, 300. [all data]
Chickos, Hosseini, et al., 1995
Chickos, James S.; Hosseini, Sarah; Hesse, Donald G.,
Determination of vaporization enthalpies of simple organic molecules by correlations of changes in gas chromatographic net retention times,
Thermochimica Acta, 1995, 249, 41-62, https://doi.org/10.1016/0040-6031(95)90670-3
. [all data]
Aldrich Chemical Company Inc., 1990
Aldrich Chemical Company Inc.,
Catalog Handbook of Fine Chemicals, Aldrich Chemical Company, Inc., Milwaukee WI, 1990, 1. [all data]
Stephenson and Malanowski, 1987
Stephenson, Richard M.; Malanowski, Stanislaw,
Handbook of the Thermodynamics of Organic Compounds, 1987, https://doi.org/10.1007/978-94-009-3173-2
. [all data]
Andon, Biddiscombe, et al., 1960, 2
Andon, R.J.L.; Biddiscombe, D.P.; Cox, J.D.; Handley, R.; Harrop, D.; Herington, E.F.G.; Martin, J.F.,
1009. Thermodynamic properties of organic oxygen compounds. Part I. Preparation and physical properties of pure phenol, cresols, and xylenols,
J. Chem. Soc., 1960, 5246, https://doi.org/10.1039/jr9600005246
. [all data]
Cox and Pilcher, 1970
Cox, J.D.; Pilcher, G.,
Thermochemistry of Organic and Organometallic Compounds, Academic Press Inc., London, 1970, 643. [all data]
Wolf and Weghofer, 1938
Wolf, K.L.; Weghofer, H.,
Uber sublimationswarmen,
Z. Phys. Chem., 1938, 39, 194-208. [all data]
Jamróz, Palczewska-Tulinska, et al., 1998
Jamróz, Malgorzata E.; Palczewska-Tulinska, Marcela; Wyrzykowska-Stankiewicz, Danuta; Szafranski, Andrzej M.; Polaczek, Jerzy; Dobrowolski, Jan Cz.; Jamróz, Michal H.; Mazurek, Aleksander P.,
The urea--phenol(s) systems,
Fluid Phase Equilibria, 1998, 152, 2, 307-326, https://doi.org/10.1016/S0378-3812(98)90206-0
. [all data]
Kobayashi and Nagakura, 1974
Kobayashi, T.; Nagakura, S.,
Photoelectron spectra of substituted benzenes,
Bull. Chem. Soc. Jpn., 1974, 47, 2563. [all data]