1,2,4-Pentatriene
- Formula: C5H6
- Molecular weight: 66.1011
- IUPAC Standard InChIKey: FNQQBQSISCLVNQ-UHFFFAOYSA-N
- CAS Registry Number: 10563-01-6
- Chemical structure:
View 3d structure (requires JavaScript / HTML 5) - Permanent link for this species. Use this link for bookmarking this species for future reference.

Gas phase thermochemistry data

Data compiled by: Glushko Thermocenter, Russian Academy of Sciences, Moscow
Constant pressure heat capacity of gas
Cp,gas (J/mol*K) | Temperature (K) | Reference | Comment |
---|---|---|---|
48.12 | 100. | Klaboe P., 1974 | |
69.79 | 200. | ||
93.18 | 300. | ||
115.19 | 400. | ||
134.01 | 500. | ||
149.79 | 600. | ||
163.01 | 700. | ||
174.26 | 800. | ||
183.93 | 900. | ||
192.25 | 1000. |

Reaction thermochemistry data

Data compiled by: Hussein Y. Afeefy, Joel F. Liebman, and Stephen E. Stein
Individual Reactions
By formula: C5H6 = C5H6
Quantity | Value | Units | Method | Reference | Comment |
---|---|---|---|---|---|
ΔrH° | -8. ± 3. | kJ/mol | Eqk | Roth, Hopf, et al., 1994 | gas phase; At 490 K |
ΔrH° | -3.6 | kJ/mol | Eqk | Pasto and Kong, 1989 | liquid phase |
By formula: C5H6 = C5H6
Quantity | Value | Units | Method | Reference | Comment |
---|---|---|---|---|---|
ΔrH° | -1. ± 7.9 | kJ/mol | Eqk | Roth, Hopf, et al., 1994 | gas phase; At 959 K |

Gas phase ion energetics data

Data compiled as indicated in comments:
LLK - Sharon G. Lias, Rhoda D. Levin, and Sherif A. Kafafi
Ionization energy determinations
IE (eV) | Method | Reference | Comment |
---|---|---|---|
8.88 ± 0.02 | PE | Bieri, Burger, et al., 1977 | LLK |
8.88 | PE | Bischof, Gleiter, et al., 1975 | LLK |
8.88 | PE | Bischof, Gleiter, et al., 1975 | Vertical value; LLK |

References

Klaboe P., 1974
Klaboe P.,
The vibrational spectra and molecular structure of 1,2,4-pentatriene (vinylallene),
Spectrochim. Acta, 1974, A30, 1527-1543. [all data]
Roth, Hopf, et al., 1994
Roth, W.R.; Hopf, H.; Horn, C.,
Propargyl-Stabilisierungsenergie,
Chem. Ber., 1994, 127, 1781-1795. [all data]
Pasto and Kong, 1989
Pasto, D.J.; Kong, W.,
Study of the substituted vinylallene-methylenecyclobutene electrocyclic equilibria. Comparison with the butadiene-cyclobutene and bisallene-bismethylenecyclobutene electrocyclic equilibria,
J. Org. Chem., 1989, 54, 4028-4033. [all data]
Bieri, Burger, et al., 1977
Bieri, G.; Burger, F.; Heilbronner, E.; Maier, J.P.,
Valence ionization enrgies of hydrocarbons,
Helv. Chim. Acta, 1977, 60, 2213. [all data]
Bischof, Gleiter, et al., 1975
Bischof, P.; Gleiter, R.; Hopf, H.; Lenich, F.T.,
Photoelectron spectra of open chain C6H6 isomers,
J. Am. Chem. Soc., 1975, 97, 5467. [all data]