1,3,5-tri-tert-butylhexahydro-1,3,5-triazine
- Formula: C15H33N3
- Molecular weight: 255.4426
- IUPAC Standard InChIKey: XNJJKNFDJBAYSE-UHFFFAOYSA-N
- CAS Registry Number: 10560-39-1
- Chemical structure:
View 3d structure (requires JavaScript / HTML 5) - Permanent link for this species. Use this link for bookmarking this species for future reference.

Gas phase ion energetics data

Data compiled by: Sharon G. Lias, John E. Bartmess, Joel F. Liebman, John L. Holmes, Rhoda D. Levin, and W. Gary Mallard
Ionization energy determinations
IE (eV) | Method | Reference | Comment |
---|---|---|---|
7.4 | PE | Beck, Hunig, et al., 1986 | |
7.7 | PE | Beck, Hunig, et al., 1986 | Vertical value |

References

Beck, Hunig, et al., 1986
Beck, K.; Hunig, S.; Poppek, R.; Prokschy, F.; Rademacher, P.,
Photoelektronenspektroscopische untersuchungen an hexahydro-1,3,5-triazinen,
Chem. Ber., 1986, 119, 554. [all data]