Diethyl carbonate
- Formula: C5H10O3
- Molecular weight: 118.1311
- IUPAC Standard InChIKey: OIFBSDVPJOWBCH-UHFFFAOYSA-N
- CAS Registry Number: 105-58-8
- Chemical structure:
View 3d structure (requires JavaScript / HTML 5) - Other names: Carbonic acid, diethyl ester; Ethyl carbonate; Diatol; Ethyl carbonate ((EtO)2CO); Eufin; C2H5OC(O)OC2H5; Ethoxyformic anhydride; Diaethylcarbonat; DEC; Diethylester kyseliny uhlicite; Diethylkarbonat; NCI-C60899; UN 2366; Diethyl ester of carbonic acid; NSC 8849

Gas phase thermochemistry data

Data compiled by: Hussein Y. Afeefy, Joel F. Liebman, and Stephen E. Stein
Quantity | Value | Units | Method | Reference | Comment |
---|---|---|---|---|---|
ΔfH°gas | -637.9 ± 0.8 | kJ/mol | Ccr | Mansson, 1972 | |
ΔfH°gas | -642.4 ± 2.2 | kJ/mol | Ccb | Choi and Joncich, 1971 | Reanalyzed by Pedley, Naylor, et al., 1986, Original value = -685.05 kJ/mol; Pedley's value is off by 10.19kcal/mol |

Condensed phase thermochemistry data

Data compiled as indicated in comments:
ALS - Hussein Y. Afeefy, Joel F. Liebman, and Stephen E. Stein
DH - Eugene S. Domalski and Elizabeth D. Hearing
Quantity | Value | Units | Method | Reference | Comment |
---|---|---|---|---|---|
ΔfH°liquid | -681.5 ± 0.8 | kJ/mol | Ccr | Mansson, 1972 | ALS |
ΔfH°liquid | -724.17 | kJ/mol | Ccb | Choi and Joncich, 1971 | Pedley's value is off by 10.19kcal/mol; ALS |
Quantity | Value | Units | Method | Reference | Comment |
ΔcH°liquid | -2715.17 ± 0.69 | kJ/mol | Ccr | Mansson, 1972 | Corresponding ΔfHºliquid = -681.53 kJ/mol (simple calculation by NIST; no Washburn corrections); ALS |
ΔcH°liquid | -2672.5 | kJ/mol | Ccb | Choi and Joncich, 1971 | Pedley's value is off by 10.19kcal/mol; Corresponding ΔfHºliquid = -724.17 kJ/mol (simple calculation by NIST; no Washburn corrections); ALS |
Constant pressure heat capacity of liquid
Cp,liquid (J/mol*K) | Temperature (K) | Reference | Comment |
---|---|---|---|
210.9 | 294.2 | Kolosovskii and Udovenko, 1934 | DH |
210.9 | 294.7 | de Kolossowsky and Udowenko, 1933 | DH |
182.0 | 298. | von Reis, 1881 | T = 297 to 416 K.; DH |

Phase change data

Data compiled as indicated in comments:
BS - Robert L. Brown and Stephen E. Stein
TRC - Thermodynamics Research Center, NIST Boulder Laboratories, Chris Muzny director
AC - William E. Acree, Jr., James S. Chickos
ALS - Hussein Y. Afeefy, Joel F. Liebman, and Stephen E. Stein
DRB - Donald R. Burgess, Jr.
Quantity | Value | Units | Method | Reference | Comment |
---|---|---|---|---|---|
Tboil | 399.6 ± 0.8 | K | AVG | N/A | Average of 8 values; Individual data points |
Quantity | Value | Units | Method | Reference | Comment |
ΔvapH° | 50. ± 30. | kJ/mol | AVG | N/A | Average of 7 values; Individual data points |
Enthalpy of vaporization
ΔvapH (kJ/mol) | Temperature (K) | Method | Reference | Comment |
---|---|---|---|---|
42.3 | 359. | EB | Xing, Fang, et al., 2009 | Based on data from 344. to 398. K.; AC |
39.7 | 367. | N/A | Rodríguez, Canosa, et al., 2002 | Based on data from 352. to 403. K.; AC |
40.9 | 323. | A | Stephenson and Malanowski, 1987 | Based on data from 308. to 400. K.; AC |
39.1 | 308. to 368. | MM | Choi and Joncich, 1971 | AC |
44.3 | 278. | N/A | Stull, 1947 | Based on data from 263. to 399. K.; AC |
Antoine Equation Parameters
log10(P) = A − (B / (T + C))
P = vapor pressure (bar)
T = temperature (K)
View plot Requires a JavaScript / HTML 5 canvas capable browser.
Temperature (K) | A | B | C | Reference | Comment |
---|---|---|---|---|---|
263.1 to 399.0 | 4.77616 | 1721.904 | -37.959 | Stull, 1947 | Coefficents calculated by NIST from author's data. |
Enthalpy of fusion
ΔfusH (kJ/mol) | Temperature (K) | Method | Reference | Comment |
---|---|---|---|---|
9.24 | 198.2 | DSC | Ding, 2004 | AC |

Gas phase ion energetics data

Data compiled by: Sharon G. Lias, John E. Bartmess, Joel F. Liebman, John L. Holmes, Rhoda D. Levin, and W. Gary Mallard
Appearance energy determinations
Ion | AE (eV) | Other Products | Method | Reference | Comment |
---|---|---|---|---|---|
CH3O3+ | 11.72 | C2H4+C2H3 | EI | Holmes and Lossing, 1982 |

References

Mansson, 1972
Mansson, M.,
Enthalpies of combustion and formation of ethyl propionate and diethyl carbonate,
J. Chem. Thermodyn., 1972, 4, 865-871. [all data]
Choi and Joncich, 1971
Choi, J.K.; Joncich, M.J.,
Heats of combustion, heats of formation and vapor pressures of some organic carbonates. Estimation of carbonate group contribution to heat of formation,
J. Chem. Eng. Data, 1971, 16, 87-90. [all data]
Pedley, Naylor, et al., 1986
Pedley, J.B.; Naylor, R.D.; Kirby, S.P.,
Thermochemical Data of Organic Compounds, Chapman and Hall, New York, 1986, 1-792. [all data]
Kolosovskii and Udovenko, 1934
Kolosovskii, N.A.; Udovenko, W.W.,
Specific heat of liquids. II.,
Zhur. Obshchei Khim., 1934, 4, 1027-1033. [all data]
de Kolossowsky and Udowenko, 1933
de Kolossowsky, N.A.; Udowenko, W.W.,
Mesure des chaleurs specifique moleculaires de quelques liquides,
Compt. rend., 1933, 197, 519-520. [all data]
von Reis, 1881
von Reis, M.A.,
Die specifische Wärme flüssiger organischer Verbindungen und ihre Beziehung zu deren Moleculargewicht,
Ann. Physik [3], 1881, 13, 447-464. [all data]
Xing, Fang, et al., 2009
Xing, Yan; Fang, Wenjun; Li, Dan; Guo, Yongsheng; Lin, Ruisen,
Density, Viscosity, and Vapor Pressure for Binary Mixtures of Tricyclo [5.2.1.0 2.6 ] Decane and Diethyl Carbonate,
J. Chem. Eng. Data, 2009, 54, 6, 1865-1870, https://doi.org/10.1021/je800984q
. [all data]
Rodríguez, Canosa, et al., 2002
Rodríguez, A.; Canosa, J.; Domínguez, A.; Tojo, J.,
Isobaric Vapor-Liquid Equilibria of Diethyl Carbonate with Four Alkanes at 101.3 kPa,
J. Chem. Eng. Data, 2002, 47, 5, 1098-1102, https://doi.org/10.1021/je010260b
. [all data]
Stephenson and Malanowski, 1987
Stephenson, Richard M.; Malanowski, Stanislaw,
Handbook of the Thermodynamics of Organic Compounds, 1987, https://doi.org/10.1007/978-94-009-3173-2
. [all data]
Stull, 1947
Stull, Daniel R.,
Vapor Pressure of Pure Substances. Organic and Inorganic Compounds,
Ind. Eng. Chem., 1947, 39, 4, 517-540, https://doi.org/10.1021/ie50448a022
. [all data]
Ding, 2004
Ding, Michael S.,
Liquid-Solid Phase Equilibria and Thermodynamic Modeling for Binary Organic Carbonates,
J. Chem. Eng. Data, 2004, 49, 2, 276-282, https://doi.org/10.1021/je034134e
. [all data]
Holmes and Lossing, 1982
Holmes, J.L.; Lossing, F.P.,
Towards a general scheme for estimating the heats of formation of organic ions in the gas phase. Part II. The effect of substitution at charge-bearing sites,
Can. J. Chem., 1982, 60, 2365. [all data]