Ethane, 1,1-diethoxy-
- Formula: C6H14O2
- Molecular weight: 118.1742
- IUPAC Standard InChIKey: DHKHKXVYLBGOIT-UHFFFAOYSA-N
- CAS Registry Number: 105-57-7
- Chemical structure:
View 3d structure (requires JavaScript / HTML 5) - Other names: Acetaldehyde, diethyl acetal; Acetal; Diethyl acetal; Ethylidene diethyl ether; 1,1-Diethoxyethane; CH3CH(OC2H5)2; Acetal diethylique; Diaethylacetal; 1,1-Diaethoxy-aethan; 1,1-Diethoxy-ethaan; 1,1-Dietossietano; Acetale; Acetol; UN 1088; USAF DO-45; Capsicum annuum l; Ethylidine diethyl ether; Diethoxy-1,1-ethane; NSC 7624; Ethanal diethyl acetal; acetal (acetaldehyde diethyl acetal)

Gas phase thermochemistry data

Data compiled by: Hussein Y. Afeefy, Joel F. Liebman, and Stephen E. Stein
Quantity | Value | Units | Method | Reference | Comment |
---|---|---|---|---|---|
ΔfH°gas | -453.6 ± 3.1 | kJ/mol | Ccb | Pihlaja and Heikkil, 1968 |

Condensed phase thermochemistry data

Data compiled as indicated in comments:
ALS - Hussein Y. Afeefy, Joel F. Liebman, and Stephen E. Stein
DH - Eugene S. Domalski and Elizabeth D. Hearing
Quantity | Value | Units | Method | Reference | Comment |
---|---|---|---|---|---|
ΔcH°liquid | -3870.5 ± 2.3 | kJ/mol | Ccb | Pihlaja and Heikkil, 1968 | Corresponding ΔfHºliquid = -491.37 kJ/mol (simple calculation by NIST; no Washburn corrections); ALS |
Constant pressure heat capacity of liquid
Cp,liquid (J/mol*K) | Temperature (K) | Reference | Comment |
---|---|---|---|
237.7 | 298. | von Reis, 1881 | T = 289 to 382 K.; DH |

Phase change data

Data compiled as indicated in comments:
BS - Robert L. Brown and Stephen E. Stein
TRC - Thermodynamics Research Center, NIST Boulder Laboratories, Chris Muzny director
AC - William E. Acree, Jr., James S. Chickos
ALS - Hussein Y. Afeefy, Joel F. Liebman, and Stephen E. Stein
Quantity | Value | Units | Method | Reference | Comment |
---|---|---|---|---|---|
Tboil | 373. ± 10. | K | AVG | N/A | Average of 8 values; Individual data points |
Quantity | Value | Units | Method | Reference | Comment |
Tc | 539.7 | K | N/A | Quadri and Kudchadker, 1991 | Uncertainty assigned by TRC = 0.5 K; TRC |
Tc | 527.6 | K | N/A | Pawlewski, 1883 | Uncertainty assigned by TRC = 10. K; TRC |
Quantity | Value | Units | Method | Reference | Comment |
Pc | 32.20 | bar | N/A | Quadri and Kudchadker, 1991 | Uncertainty assigned by TRC = 0.20 bar; TRC |
Quantity | Value | Units | Method | Reference | Comment |
ΔvapH° | 39.6 ± 0.3 | kJ/mol | GS | Verevkin, Peng, et al., 1998 | Based on data from 275. to 308. K. See also Verevkin, 2002.; AC |
ΔvapH° | 37.8 ± 0.84 | kJ/mol | V | Pihlaja and Heikkil, 1968 | ALS |
Reduced pressure boiling point
Tboil (K) | Pressure (bar) | Reference | Comment |
---|---|---|---|
294.2 | 0.029 | Weast and Grasselli, 1989 | BS |
Enthalpy of vaporization
ΔvapH (kJ/mol) | Temperature (K) | Method | Reference | Comment |
---|---|---|---|---|
41.6 | 296. | A | Stephenson and Malanowski, 1987 | Based on data from 281. to 384. K. See also Dykyj, 1972.; AC |
39.8 | 288. | N/A | Nicolini and Laffitte, 1949 | Based on data from 273. to 343. K. See also Boublik, Fried, et al., 1984.; AC |
36.2 | 255. | N/A | Stull, 1947 | Based on data from 239. to 392. K.; AC |
Antoine Equation Parameters
log10(P) = A − (B / (T + C))
P = vapor pressure (bar)
T = temperature (K)
View plot Requires a JavaScript / HTML 5 canvas capable browser.
Temperature (K) | A | B | C | Reference | Comment |
---|---|---|---|---|---|
273. to 343. | 4.04522 | 1272.727 | -61.87 | Nicolini and Laffitte, 1949, 2 | Coefficents calculated by NIST from author's data. |
250. to 375.3 | 4.7498 | 1573.964 | -43.681 | Stull, 1947 | Coefficents calculated by NIST from author's data. |
Enthalpy of fusion
ΔfusH (kJ/mol) | Temperature (K) | Reference | Comment |
---|---|---|---|
10.95 | 167. | Teodorescu, Wilken, et al., 2003 | AC |

Henry's Law data

Data compiled by: Rolf Sander
Henry's Law constant (water solution)
kH(T) = k°H exp(d(ln(kH))/d(1/T) ((1/T) - 1/(298.15 K)))
k°H = Henry's law constant for solubility in water at 298.15 K (mol/(kg*bar))
d(ln(kH))/d(1/T) = Temperature dependence constant (K)
k°H (mol/(kg*bar)) | d(ln(kH))/d(1/T) (K) | Method | Reference |
---|---|---|---|
10. | V | N/A |

Gas phase ion energetics data

Data compiled by: Sharon G. Lias, John E. Bartmess, Joel F. Liebman, John L. Holmes, Rhoda D. Levin, and W. Gary Mallard
Ionization energy determinations
IE (eV) | Method | Reference | Comment |
---|---|---|---|
9.2 | PE | Zverev, Villem, et al., 1982 | |
9.78 | PE | Zverev, Villem, et al., 1982 | Vertical value |

Kovats' RI, non-polar column, isothermal

Column type | Active phase | Temperature (C) | I | Reference | Comment |
---|---|---|---|---|---|
Packed | SE-30 | 150. | 710. | Tiess, 1984 | Ar, Gas Chrom Q (80-100 mesh); Column length: 3. m |
Packed | SE-30 | 100. | 717. | Winskowski, 1983 | Gaschrom Q; Column length: 2. m |
Packed | Silicon High Vacuum Grease (obsolete) | 90. | 720. | Jonas, Janák, et al., 1966 | H2 |

Kovats' RI, polar column, isothermal

Column type | Active phase | Temperature (C) | I | Reference | Comment |
---|---|---|---|---|---|
Packed | Carbowax 20M | 75. | 910. | Goebel, 1982 | N2, Kieselgur (60-100 mesh); Column length: 2. m |

Kovats' RI, polar column, temperature ramp

Column type | Active phase | I | Reference | Comment |
---|---|---|---|---|
Capillary | Carbowax 20M | 866. | Toda, Yamaguchi, et al., 1982 | 2. K/min; Column length: 50. m; Column diameter: 0.28 mm; Tstart: 80. C; Tend: 200. C |
Capillary | Carbowax 20M | 867. | Toda, Yamaguchi, et al., 1982 | 2. K/min; Column length: 50. m; Column diameter: 0.28 mm; Tstart: 80. C; Tend: 200. C |

Kovats' RI, polar column, custom temperature program

Column type | Active phase | I | Reference | Comment |
---|---|---|---|---|
Capillary | Carbowax 20M | 886. | Brander, Kepner, et al., 1980 | Program: not specified |
Capillary | Carbowax 20M | 889. | Brander, Kepner, et al., 1980 | Program: not specified |

Van Den Dool and Kratz RI, non-polar column, temperature ramp

Column type | Active phase | I | Reference | Comment |
---|---|---|---|---|
Capillary | DB-1 | 717.3 | Sun and Stremple, 2003 | 30. m/0.25 mm/0.25 μm, He, 3. K/min; Tstart: 40. C; Tend: 325. C |
Capillary | HP-5 | 725. | David, Scanlan, et al., 2000 | 50. m/0.32 mm/1.05 μm, He, 2. K/min; Tstart: 50. C; Tend: 290. C |
Capillary | DB-5 | 730. | Moio L., Rillo L., et al., 1996 | 30. m/0.32 mm/1. μm, H2, 3. K/min; Tstart: 40. C; Tend: 220. C |
Capillary | OV-101 | 715. | Misharina, Aerove, et al., 1991 | 50. m/0.32 mm/0.50 μm, He, 2. K/min; Tstart: 50. C; Tend: 250. C |

Van Den Dool and Kratz RI, non-polar column, custom temperature program

Column type | Active phase | I | Reference | Comment |
---|---|---|---|---|
Capillary | SE-54 | 729. | Fritsch and Schieberle, 2005 | 30. m/0.32 mm/0.25 μm, He; Program: 35C(2min) => 40C/min => 50C(2min) => 6C/min => 180C => 20C/min => 230C(10min) |
Capillary | SE-54 | 736. | Fritsch and Schieberle, 2005 | 30. m/0.32 mm/0.25 μm, He; Program: 35C(2min) => 40C/min => 50C(2min) => 6C/min => 180C => 20C/min => 230C(10min) |

Van Den Dool and Kratz RI, polar column, custom temperature program

Column type | Active phase | I | Reference | Comment |
---|---|---|---|---|
Capillary | FFAP | 900. | Fritsch and Schieberle, 2005 | 30. m/0.32 mm/0.25 μm, He; Program: 35C(2min) => 40C/min => 60C(2min) => 6C/min => 180C => 20C/min => 230C(10min) |

Normal alkane RI, non-polar column, temperature ramp

Column type | Active phase | I | Reference | Comment |
---|---|---|---|---|
Capillary | HP-5 MS | 725. | Forero, Quijano, et al., 2008 | 30. m/0.25 mm/0.25 μm, Helium, 50. C @ 4. min, 4. K/min, 230. C @ 10. min |
Capillary | DB-1 | 714. | Kumazawa, Itobe, et al., 2008 | 30. m/0.25 mm/0.25 μm, He, 5. K/min; Tstart: 30. C; Tend: 210. C |
Capillary | DB-5 | 726. | Xu, Fan, et al., 2007 | 30. m/0.32 mm/0.25 μm, He, 40. C @ 2. min, 4. K/min, 250. C @ 5. min |
Capillary | DB-1 | 719. | Chen, Sheu, et al., 2006 | Nitrogen, 40. C @ 1. min, 2. K/min, 200. C @ 9. min; Column length: 60. m; Column diameter: 0.25 mm |
Capillary | DB-5 | 726. | Fan and Qian, 2006 | 30. m/0.32 mm/1. μm, He, 40. C @ 2. min, 4. K/min, 250. C @ 15. min |
Capillary | DB-5 | 719. | Fan and Qian, 2006, 2 | 30. m/0.32 mm/1. μm, N2, 40. C @ 2. min, 6. K/min, 230. C @ 15. min |
Capillary | DB-5 | 730. | de Souza, Vásquez, et al., 2006 | He, 35. C @ 3. min, 6. K/min; Column length: 13.5 m; Column diameter: 0.32 mm; Tend: 225. C |
Capillary | DB-5 | 726. | Fan and Qian, 2005 | 30. m/0.32 mm/0.25 μm, N2, 40. C @ 2. min, 4. K/min, 250. C @ 5. min |
Capillary | SPB-5 | 726. | Ledauphin, Guichard, et al., 2003 | 30. m/0.32 mm/0.25 μm, He, 40. C @ 1. min, 5. K/min, 220. C @ 20. min |
Capillary | AT-1 | 727. | Kelling, 2001 | He, 50. C @ 2. min, 10. K/min; Tend: 300. C |
Capillary | Methyl Silicone | 722.16 | Baraldi, Rapparini, et al., 1999 | 60. m/0.25 mm/0.25 μm, 40. C @ 10. min, 5. K/min; Tend: 220. C |
Capillary | DB-1 | 725. | Yu, Wu, et al., 1994 | 60. m/0.25 mm/1. μm, He, 40. C @ 5. min, 2. K/min, 260. C @ 60. min |
Capillary | DB-5 | 730. | Moio, Dekimpe, et al., 1993 | 30. m/0.32 mm/1. μm, H2, 3. K/min; Tstart: 40. C; Tend: 220. C |
Capillary | OV-101 | 718. | Misharina, Golovnya, et al., 1991 | 50. m/0.32 mm/0.5 μm, He, 4. K/min; Tstart: 50. C; Tend: 250. C |
Capillary | SF96+Igepal | 715. | Lorenz, Stern, et al., 1983 | 45. C @ 30. min, 2. K/min; Column length: 213. m; Column diameter: 0.7 mm; Tend: 200. C |
Capillary | SE-30 | 727. | Alves and Jennings, 1979 | Helium, 2. K/min; Tstart: 70. C; Tend: 170. C |

Normal alkane RI, non-polar column, custom temperature program

Column type | Active phase | I | Reference | Comment |
---|---|---|---|---|
Capillary | Polydimethyl siloxane with 5 % Ph groups | 726. | Robinson, Adams, et al., 2012 | Program: not specified |
Capillary | Polydimethyl siloxane with 5 % Ph groups | 743. | Robinson, Adams, et al., 2012 | Program: not specified |
Capillary | HP-5 | 727. | Zhao, Li, et al., 2008 | 30. m/0.25 mm/0.25 μm; Program: 40 0C (2 min) 5 0C/min -> 80 0C 7 oC/min -> 160 0C 9 0C/min -> 200 0C 20 0C/min -> 280 0C (10 min) |
Capillary | HP-5 | 726. | Zhao, Li, et al., 2008 | 30. m/0.25 mm/0.25 μm; Program: not specified |
Capillary | SE-30 | 710. | Vinogradov, 2004 | Program: not specified |
Capillary | HP-5 | 734. | Jordán, Margaría, et al., 2003 | 30. m/0.25 mm/0.25 μm; Program: 40C(6min) => 2.5C/min => 150C => 90C/min => 250C |
Capillary | HP-5 | 725.1 | David, Scanlan, et al., 2002 | 50. m/0.32 mm/1.05 μm, He; Program: not specified |
Capillary | HP-5 | 719. | Jordán, Goodner, et al., 2002 | 30. m/0.25 mm/0.25 μm; Program: not specified |
Capillary | BPX-5 | 724. | Madruga, Arruda, et al., 2000 | 50. m/0.32 mm/0.50 μm, Helium; Program: 40 0C (5 min) 20 0C/min -> 60 0C (5 min) 4 0C/min -> 250 0C (10 min) |
Capillary | DB-5 | 730. | Guth, 1997 | 30. m/0.32 mm/0.25 μm; Program: 35C (1min) => 40C/min => 60C (1min) => 6C/min => 250C (10min) |
Capillary | SE-54 | 730. | Guth, 1997 | 30. m/0.32 mm/0.25 μm; Program: 35C (1min) => 40C/min => 60C (1min) => 6C/min => 250C (10min) |
Capillary | OV-1, SE-30, Methyl silicone, SP-2100, OV-101, DB-1, etc. | 717. | Waggott and Davies, 1984 | Hydrogen; Column length: 50. m; Column diameter: 0.32 mm; Program: not specified |

Normal alkane RI, polar column, temperature ramp

Column type | Active phase | I | Reference | Comment |
---|---|---|---|---|
Capillary | CP-Wax 57 CB | 928. | Callejon, Morales, et al., 2008 | 50. m/0.25 mm/0.20 μm, Hydrogen, 35. C @ 5. min, 4. K/min, 150. C @ 17.5 min |
Capillary | DB-Wax | 894. | Kumazawa, Itobe, et al., 2008 | 30. m/0.25 mm/0.25 μm, He, 5. K/min; Tstart: 30. C; Tend: 210. C |
Capillary | DB-Wax | 889. | Xu, Fan, et al., 2007 | 30. m/0.25 mm/0.25 μm, He, 40. C @ 2. min, 4. K/min, 230. C @ 5. min |
Capillary | DB-Wax | 892. | Fan and Qian, 2006 | 30. m/0.32 mm/0.25 μm, He, 40. C @ 2. min, 4. K/min, 230. C @ 15. min |
Capillary | DB-Wax | 891. | Fan and Qian, 2006, 2 | 30. m/0.32 mm/0.25 μm, N2, 40. C @ 2. min, 6. K/min, 230. C @ 15. min |
Capillary | DB-Wax | 889. | Fan and Qian, 2005 | 30. m/0.32 mm/0.25 μm, N2, 40. C @ 2. min, 4. K/min, 230. C @ 5. min |
Capillary | DB-Wax | 900. | Lee and Noble, 2003 | 30. m/0.25 mm/0.25 μm, He, 40. C @ 4. min, 4. K/min, 185. C @ 20. min |
Capillary | DB-Wax | 898. | Umano, Hagi, et al., 1995 | He, 40. C @ 2. min, 2. K/min; Column length: 60. m; Column diameter: 0.25 mm; Tend: 200. C |
Capillary | Carbowax 20M | 890. | Mihara, Tateba, et al., 1988 | N2, 3. K/min; Column length: 50. m; Column diameter: 0.22 mm; Tstart: 80. C; Tend: 200. C |
Capillary | Carbowax 20M | 890. | Mihara, Tateba, et al., 1988 | N2, 3. K/min; Column length: 50. m; Column diameter: 0.22 mm; Tstart: 80. C; Tend: 200. C |
Capillary | Carbowax 20M | 890. | Mihara, Tateba, et al., 1987 | N2, 3. K/min; Column length: 50. m; Column diameter: 0.22 mm; Tstart: 80. C; Tend: 200. C |
Capillary | Carbowax 20M | 890. | Mihara, Tateba, et al., 1987 | N2, 3. K/min; Column length: 50. m; Column diameter: 0.22 mm; Tstart: 80. C; Tend: 200. C |
Capillary | BP-20 | 880. | MacLeod and Snyder, 1985 | 70. C @ 5. min, 3. K/min; Column length: 25. m; Column diameter: 0.2 mm; Tend: 180. C |

Normal alkane RI, polar column, custom temperature program

Column type | Active phase | I | Reference | Comment |
---|---|---|---|---|
Capillary | Supelco CO Wax-10 | 925. | Prompona, Kandylis, et al., 2012 | 60. m/0.32 mm/0.25 μm, Helium; Program: 35 0C (6 min) 2 0C/min -> 60 0C (5 min) 5 0C/min -> 200 0C 25 0C/min -> 250 0C (6 min) |
Capillary | Supelco CO Wax-10 | 930. | Prompona, Kandylis, et al., 2012 | 60. m/0.32 mm/0.25 μm, Helium; Program: not specified |
Capillary | Carbowax 20M | 880. | Vinogradov, 2004 | Program: not specified |
Capillary | DB-FFAP | 900. | Guth, 1997 | 30. m/0.32 mm/0.25 μm; Program: 35C (1min) => 40C/min => 60C (1min) => 6C/min => 250C (10min) |
Capillary | DB-FFAP | 900. | Guth, 1997 | 30. m/0.32 mm/0.25 μm; Program: 35C (1min) => 40C/min => 60C (1min) => 6C/min => 250C (10min) |

References

Pihlaja and Heikkil, 1968
Pihlaja, K.; Heikkil, J.,
Heats of combustion. Diethyl ether and 1,1-diethoxyethane,
Acta Chem. Scand., 1968, 22, 2731-2732. [all data]
von Reis, 1881
von Reis, M.A.,
Die specifische Wärme flüssiger organischer Verbindungen und ihre Beziehung zu deren Moleculargewicht,
Ann. Physik [3], 1881, 13, 447-464. [all data]
Quadri and Kudchadker, 1991
Quadri, S.K.; Kudchadker, A.P.,
Measurement of the critical temperatures and critical pressures of some thermally stable or mildly unstable esters, ketones, and ethers,
J. Chem. Thermodyn., 1991, 23, 129-34. [all data]
Pawlewski, 1883
Pawlewski, B.,
Critical temperatures of some liquids,
Ber. Dtsch. Chem. Ges., 1883, 16, 2633-36. [all data]
Verevkin, Peng, et al., 1998
Verevkin, S.P.; Peng, W.-H.; Beckhaus, H.D.; Rücuardt, C.,
Geminal substituent effects. 16. Does the anomeric effect in ketals depend on the hybridization of the central carbon atom?,
Eur. J. Org. Chem., 1998, 11, 2323. [all data]
Verevkin, 2002
Verevkin, Sergey P.,
Improved Benson Increments for the Estimation of Standard Enthalpies of Formation and Enthalpies of Vaporization of Alkyl Ethers, Acetals, Ketals, and Ortho Esters,
J. Chem. Eng. Data, 2002, 47, 5, 1071-1097, https://doi.org/10.1021/je020023o
. [all data]
Weast and Grasselli, 1989
CRC Handbook of Data on Organic Compounds, 2nd Editon, Weast,R.C and Grasselli, J.G., ed(s)., CRC Press, Inc., Boca Raton, FL, 1989, 1. [all data]
Stephenson and Malanowski, 1987
Stephenson, Richard M.; Malanowski, Stanislaw,
Handbook of the Thermodynamics of Organic Compounds, 1987, https://doi.org/10.1007/978-94-009-3173-2
. [all data]
Dykyj, 1972
Dykyj, J.,
Petrochemia, 1972, 12, 1, 13. [all data]
Nicolini and Laffitte, 1949
Nicolini, E.; Laffitte, P.,
Compt. Rend., 1949, 229, 757. [all data]
Boublik, Fried, et al., 1984
Boublik, T.; Fried, V.; Hala, E.,
The Vapour Pressures of Pure Substances: Selected Values of the Temperature Dependence of the Vapour Pressures of Some Pure Substances in the Normal and Low Pressure Region, 2nd ed., Elsevier, New York, 1984, 972. [all data]
Stull, 1947
Stull, Daniel R.,
Vapor Pressure of Pure Substances. Organic and Inorganic Compounds,
Ind. Eng. Chem., 1947, 39, 4, 517-540, https://doi.org/10.1021/ie50448a022
. [all data]
Nicolini and Laffitte, 1949, 2
Nicolini, E.; Laffitte, P.,
Tensions de Vapeur de Quelques Liquides Organiques Purs,
Compt. Rend., 1949, 229, 757-759. [all data]
Teodorescu, Wilken, et al., 2003
Teodorescu, Mariana; Wilken, Michael; Wittig, Roland; Gmehling, Jürgen,
Azeotropic and solid--liquid equilibria data for several binary organic systems containing one acetal compound,
Fluid Phase Equilibria, 2003, 204, 2, 267-280, https://doi.org/10.1016/S0378-3812(02)00260-1
. [all data]
Zverev, Villem, et al., 1982
Zverev, V.V.; Villem, Ya.Ya.; Villem, N.V.; Klimovitskii, E.N.; Arbuzov, B.A.,
Photoelectron spectra and intramolecular interactions of dimethoxymethane and 4,7-dihydro-1,3-dioxepin,
J. Gen. Chem. USSR, 1982, 52, 1674, In original 1888. [all data]