1,3,5-Triazine, hexahydro-1,3,5-tris(1-methylethyl)-
- Formula: C12H27N3
- Molecular weight: 213.3629
- IUPAC Standard InChIKey: FBXRCTMIDHCRDT-UHFFFAOYSA-N
- CAS Registry Number: 10556-98-6
- Chemical structure:
View 3d structure (requires JavaScript / HTML 5) - Other names: s-Triazine, hexahydro-1,3,5-triisopropyl-; Hexahydro-1,3,5-triisopropyl-s-triazine; 1,3,5-Triisopropylhexahydro-1,3,5-triazine; 1,3,5-Triisopropyl hexahydro-sym-triazine

Gas phase ion energetics data

Data compiled by: Sharon G. Lias, John E. Bartmess, Joel F. Liebman, John L. Holmes, Rhoda D. Levin, and W. Gary Mallard
Ionization energy determinations
IE (eV) | Method | Reference | Comment |
---|---|---|---|
7.5 | PE | Beck, Hunig, et al., 1986 | |
7.95 | PE | Beck, Hunig, et al., 1986 | Vertical value |

References

Beck, Hunig, et al., 1986
Beck, K.; Hunig, S.; Poppek, R.; Prokschy, F.; Rademacher, P.,
Photoelektronenspektroscopische untersuchungen an hexahydro-1,3,5-triazinen,
Chem. Ber., 1986, 119, 554. [all data]