Butanoic acid, ethyl ester
- Formula: C6H12O2
- Molecular weight: 116.1583
- IUPAC Standard InChIKey: OBNCKNCVKJNDBV-UHFFFAOYSA-N
- CAS Registry Number: 105-54-4
- Chemical structure:
View 3d structure (requires JavaScript / HTML 5) - Isotopologues:
- Other names: Butyric acid, ethyl ester; Ethyl butanoate; Ethyl butyrate; Ethyl n-butyrate; Ethyl n-butanoate; n-Butyric acid ethyl ester; UN 1180; Ethyl ester of butanoic acid; NSC 8857; ethyl butanoate (ethyl butyrate); ethyl 1-butyrate

Condensed phase thermochemistry data

Data compiled as indicated in comments:
ALS - Hussein Y. Afeefy, Joel F. Liebman, and Stephen E. Stein
DH - Eugene S. Domalski and Elizabeth D. Hearing
Quantity | Value | Units | Method | Reference | Comment |
---|---|---|---|---|---|
ΔfH°liquid | -528.40 ± 0.79 | kJ/mol | Cm | Wiberg and Waldron, 1991 | Heat of hydrolysis; ALS |
Quantity | Value | Units | Method | Reference | Comment |
ΔcH°liquid | -3545. | kJ/mol | Ccb | Handrick, 1956 | National Bureau of Standards Report 5B116, 1952; Corresponding ΔfHºliquid = -531.4 kJ/mol (simple calculation by NIST; no Washburn corrections); ALS |
ΔcH°liquid | -3539. | kJ/mol | Ccb | Schjanberg, 1935 | Corresponding ΔfHºliquid = -536.8 kJ/mol (simple calculation by NIST; no Washburn corrections); ALS |
Constant pressure heat capacity of liquid
Cp,liquid (J/mol*K) | Temperature (K) | Reference | Comment |
---|---|---|---|
228.0 | 298.15 | Fuchs, 1979 | DH |
229.7 | 290. | Kurnakov and Voskresenskaya, 1936 | DH |
220.1 | 297.2 | Kolosovskii and Udovenko, 1934 | DH |
220.1 | 297.2 | de Kolossowsky and Udowenko, 1933 | DH |

Phase change data

Data compiled as indicated in comments:
TRC - Thermodynamics Research Center, NIST Boulder Laboratories, Chris Muzny director
BS - Robert L. Brown and Stephen E. Stein
ALS - Hussein Y. Afeefy, Joel F. Liebman, and Stephen E. Stein
DRB - Donald R. Burgess, Jr.
AC - William E. Acree, Jr., James S. Chickos
Quantity | Value | Units | Method | Reference | Comment |
---|---|---|---|---|---|
Tboil | 394. ± 2. | K | AVG | N/A | Average of 37 out of 40 values; Individual data points |
Quantity | Value | Units | Method | Reference | Comment |
Tfus | 175.3 | K | N/A | Timmermans, 1922 | Uncertainty assigned by TRC = 0.3 K; TRC |
Tfus | 170.65 | K | N/A | Timmermans and Mattaar, 1921 | Uncertainty assigned by TRC = 0.7 K; TRC |
Quantity | Value | Units | Method | Reference | Comment |
Tc | 568.8 | K | N/A | Young, 1994 | Uncertainty assigned by TRC = 0.6 K; TRC |
Tc | 558.7 | K | N/A | De Heen, 1888 | Uncertainty assigned by TRC = 10. K; TRC |
Tc | 566.0 | K | N/A | Nadezhdin, 1887 | Uncertainty assigned by TRC = 2. K; TRC |
Tc | 577.5 | K | N/A | Pawlewski, 1882 | Uncertainty assigned by TRC = 6. K; TRC |
Quantity | Value | Units | Method | Reference | Comment |
Pc | 30.64 | bar | N/A | Nadezhdin, 1887 | Uncertainty assigned by TRC = 1.5199 bar; TRC |
Quantity | Value | Units | Method | Reference | Comment |
ρc | 2.38 | mol/l | N/A | Nadezhdin, 1887 | Uncertainty assigned by TRC = 0.086 mol/l; TRC |
Quantity | Value | Units | Method | Reference | Comment |
ΔvapH° | 42. ± 4. | kJ/mol | AVG | N/A | Average of 8 values; Individual data points |
Enthalpy of vaporization
ΔvapH (kJ/mol) | Temperature (K) | Method | Reference | Comment |
---|---|---|---|---|
39.4 | 345. | N/A | Hernández and Ortega, 1997 | Based on data from 330. to 435. K.; AC |
40.2 | 347. | N/A | Fárková and Wichterle, 1993 | Based on data from 332. to 393. K.; AC |
42.1 ± 0.1 | 323. | EB | Wiberg and Waldron, 1991 | Based on data from 310. to 336. K.; AC |
48.3 | 278. | A | Stephenson and Malanowski, 1987 | Based on data from 263. to 404. K.; AC |
35.47 | 394.6 | N/A | Majer and Svoboda, 1985 | |
41.8 | 270. | N/A | Stull, 1947 | Based on data from 254. to 394. K.; AC |
Antoine Equation Parameters
log10(P) = A − (B / (T + C))
P = vapor pressure (bar)
T = temperature (K)
View plot Requires a JavaScript / HTML 5 canvas capable browser.
Temperature (K) | A | B | C | Reference | Comment |
---|---|---|---|---|---|
254.8 to 394. | 4.33187 | 1509.443 | -45.284 | Stull, 1947 | Coefficents calculated by NIST from author's data. |

Henry's Law data

Data compiled by: Rolf Sander
Henry's Law constant (water solution)
kH(T) = k°H exp(d(ln(kH))/d(1/T) ((1/T) - 1/(298.15 K)))
k°H = Henry's law constant for solubility in water at 298.15 K (mol/(kg*bar))
d(ln(kH))/d(1/T) = Temperature dependence constant (K)
k°H (mol/(kg*bar)) | d(ln(kH))/d(1/T) (K) | Method | Reference |
---|---|---|---|
2.8 | V | N/A |

Gas phase ion energetics data

Data compiled by: Sharon G. Lias, Rhoda D. Levin, and Sherif A. Kafafi
Appearance energy determinations
Ion | AE (eV) | Other Products | Method | Reference | Comment |
---|---|---|---|---|---|
C4H8O2+ | 10.06 | C2H4 | EI | Holmes and Lossing, 1980 |

Gas phase thermochemistry data

Data compiled by: Hussein Y. Afeefy, Joel F. Liebman, and Stephen E. Stein
Quantity | Value | Units | Method | Reference | Comment |
---|---|---|---|---|---|
ΔfH°gas | -485. ± 1. | kJ/mol | Cm | Wiberg and Waldron, 1991 | Heat of hydrolysis |

Kovats' RI, non-polar column, isothermal

Column type | Active phase | Temperature (C) | I | Reference | Comment |
---|---|---|---|---|---|
Capillary | OV-1 | 333. | 784. | Hu, Lu, et al., 2006 | |
Capillary | SE-30 | 100. | 780.2 | Tudor, 1997 | 40. m/0.35 mm/0.35 μm |
Capillary | SE-30 | 100. | 802. | Haken and Korhonen, 1985 | N2; Column length: 25. m; Column diameter: 0.33 mm |
Capillary | SE-30 | 120. | 783. | Haken and Korhonen, 1985 | N2; Column length: 25. m; Column diameter: 0.33 mm |
Capillary | SE-30 | 80. | 792. | Haken and Korhonen, 1985 | N2; Column length: 25. m; Column diameter: 0.33 mm |
Capillary | SE-30 | 140. | 796. | Korhonen, 1985 | N2; Column length: 25. m; Column diameter: 0.33 mm |
Capillary | SE-30 | 160. | 806. | Korhonen, 1985 | N2; Column length: 25. m; Column diameter: 0.33 mm |
Capillary | OV-101 | 80. | 782. | Komárek, Hornová, et al., 1983 | Column length: 15. m; Column diameter: 0.22 mm |
Packed | SE-30 | 100. | 781. | Winskowski, 1983 | Gaschrom Q; Column length: 2. m |
Packed | Porapack Q | 200. | 760. | Goebel, 1982 | N2 |
Capillary | OV-101 | 80. | 782. | Komárek, Hornová, et al., 1982 | N2; Column length: 15. m; Column diameter: 0.22 mm |
Packed | SE-30 | 150. | 778. | Ashes and Haken, 1974 | Celaton (62-72 mesh); Column length: 3.7 m |
Packed | SE-30 | 100. | 782. | Chastrette, Heintz, et al., 1974 | N2, Chromosorb W AW (60-80 mesh); Column length: 3. m |
Packed | OV-1 | 150. | 788. | Ashes and Haken, 1971 | |
Packed | SE-30 | 100. | 784. | Zarazir, Chovin, et al., 1970 | Chromosorb W; Column length: 2. m |
Packed | SE-30 | 150. | 788. | Germaine and Haken, 1969 | Celite 560; Column length: 3.7 m |
Packed | DC-200 | 120. | 775. | Reymond, Mueggler-Chavan, et al., 1966 | Celite; Column length: 4. m |

Kovats' RI, non-polar column, temperature ramp

Column type | Active phase | I | Reference | Comment |
---|---|---|---|---|
Capillary | OV-101 | 785. | Marin, Acree, et al., 1992 | He, 35. C @ 3. min, 6. K/min; Column length: 12. m; Column diameter: 0.32 mm; Tend: 185. C |
Capillary | DB-1 | 793. | Takeoka, Buttery, et al., 1992 | 60. m/0.32 mm/0.25 μm, He, 30. C @ 4. min, 2. K/min; Tend: 210. C |
Capillary | DB-1 | 789. | Takeoka, Buttery, et al., 1992 | 60. m/0.32 mm/0.25 μm, He, 30. C @ 4. min, 2. K/min; Tend: 210. C |
Capillary | DB-1 | 791. | Takeoka, Buttery, et al., 1992 | 60. m/0.32 mm/0.25 μm, He, 30. C @ 4. min, 2. K/min; Tend: 210. C |
Capillary | DB-1 | 792. | Takeoka, Buttery, et al., 1992 | 60. m/0.32 mm/0.25 μm, He, 30. C @ 4. min, 2. K/min; Tend: 210. C |
Capillary | DB-1 | 789. | Takeoka, Flath, et al., 1990 | 60. m/0.32 mm/0.25 μm, He, 30. C @ 4. min, 2. K/min; Tend: 210. C |
Capillary | DB-1 | 789. | Takeoka, Flath, et al., 1990 | 60. m/0.32 mm/0.25 μm, He, 30. C @ 4. min, 2. K/min; Tend: 210. C |
Capillary | BP-1 | 790. | Bartley and Schwede, 1989 | He, 30. C @ 2. min, 2. K/min; Column length: 50. m; Column diameter: 0.23 mm; Tend: 200. C |
Capillary | BP-1 | 793. | Bartley, 1988 | He, 2. K/min; Column length: 50. m; Tstart: -100. C; Tend: 200. C |
Capillary | OV-101 | 790. | Morales and Duque, 1987 | He, 2. K/min; Column length: 25. m; Column diameter: 0.31 mm; Tstart: 60. C; Tend: 200. C |
Packed | Apiezon L | 764. | Rasmussen, 1983 | Chromosorb W HMDS HP (00-120 mesh), 4. K/min; Column length: 1.2 m; Tstart: 50. C; Tend: 200. C |

Kovats' RI, non-polar column, custom temperature program

Column type | Active phase | I | Reference | Comment |
---|---|---|---|---|
Capillary | DB-5 | 799. | Andrade, Santos, et al., 1998 | 30. m/0.25 mm/0.25 μm, He; Program: 40C => 2C/min => 60C => 4C/min => 260C |
Capillary | DB-5 | 798. | Santos, Andrade, et al., 1998 | 30. m/0.25 mm/0.25 μm, He; Program: 40C => 2C/min => 60C => 4C/min => 240C |
Packed | Apiezon L | 764. | Rasmussen, 1983 | Chromosorb W HMDS HP (00-120 mesh); Column length: 1.2 m; Program: not specified |
Capillary | SE-30 | 790. | Brander, Kepner, et al., 1980 | Column length: 80. m; Column diameter: 0.29 mm; Program: not specified |
Capillary | SE-30 | 791. | Brander, Kepner, et al., 1980 | Column length: 80. m; Column diameter: 0.29 mm; Program: not specified |
Capillary | SE-30 | 778. | Chretien and Dubois, 1978 | Program: not specified |

Kovats' RI, polar column, isothermal

Column type | Active phase | Temperature (C) | I | Reference | Comment |
---|---|---|---|---|---|
Capillary | OV-351 | 120. | 1025. | Korhonen, 1985 | N2; Column length: 25. m; Column diameter: 0.32 mm |
Capillary | OV-351 | 140. | 1051. | Korhonen, 1985 | N2; Column length: 25. m; Column diameter: 0.32 mm |
Packed | Carbowax 20M | 75. | 1054. | Goebel, 1982 | N2, Kieselgur (60-100 mesh); Column length: 2. m |
Packed | Carbowax 20M | 100. | 1008. | Kevei and Kozma, 1976 | Chromosorb |
Packed | Carbowax 20M | 100. | 1032. | Chastrette, Heintz, et al., 1974 | Chromosorb WAW (60-80 mesh); Column length: 3. m |
Packed | Carbowax 20M | 100. | 1045. | Zarazir, Chovin, et al., 1970 | Chromosorb W; Column length: 2. m |
Packed | Carbowax 20M | 125. | 1032. | van den Dool and Kratz, 1963 | Celite 545 |

Kovats' RI, polar column, temperature ramp

Column type | Active phase | I | Reference | Comment |
---|---|---|---|---|
Capillary | Supelcowax-10 | 1058. | Wong and Teng, 1994 | He, 35. C @ 5. min, 3. K/min, 200. C @ 20. min; Column length: 60. m; Column diameter: 0.25 mm |
Capillary | BP-20 | 1057. | Wyllie and Leach, 1990 | 70. C @ 2. min, 4. K/min; Column length: 25. m; Column diameter: 0.32 mm; Tend: 200. C |
Capillary | Carbowax 20M | 1010. | Nishimura, Yamaguchi, et al., 1989 | 2. K/min; Column length: 50. m; Column diameter: 0.22 mm; Tstart: 80. C; Tend: 200. C |
Capillary | DB-Wax | 1044. | Umano, Shoji, et al., 1986 | N2, 60. C @ 10. min, 2. K/min; Column length: 30. m; Column diameter: 0.25 mm; Tend: 200. C |
Capillary | DB-Wax | 1044. | Umano, Shoji, et al., 1986 | N2, 60. C @ 10. min, 2. K/min; Column length: 30. m; Column diameter: 0.25 mm; Tend: 200. C |
Capillary | Carbowax 20M | 1040. | Buttery, Seifert, et al., 1982 | He, 1. K/min; Column length: 150. m; Column diameter: 0.64 mm; Tstart: 50. C; Tend: 170. C |

Kovats' RI, polar column, custom temperature program

Column type | Active phase | I | Reference | Comment |
---|---|---|---|---|
Capillary | DB-Wax | 1026. | Rezende and Fraga, 2003 | 30. m/0.25 mm/0.25 μm, He; Program: 40C(5min) => 5C/min => 150C => 8C/min => 240C(25min) |
Capillary | Carbowax 20M | 1042. | Garruti, Franco, et al., 2001 | H2; Column length: 30. m; Column diameter: 0.25 mm; Program: 50 0C (8 min) 4 K/min -> 110 0C 16 K/min -> 200 0C |
Capillary | Carbowax 20M | 1043. | Brander, Kepner, et al., 1980 | Program: not specified |
Capillary | Carbowax 20M | 1045. | Brander, Kepner, et al., 1980 | Program: not specified |
Packed | Carbowax 20M | 1005. | Kevei and Kozma, 1976 | Chromosorb; Program: not specified |

Van Den Dool and Kratz RI, non-polar column, temperature ramp

Column type | Active phase | I | Reference | Comment |
---|---|---|---|---|
Capillary | DB-5MS | 779. | Lozano P.R., Miracle E.R., et al., 2007 | 30. m/0.25 mm/0.25 μm, He, 35. C @ 5. min, 10. K/min, 225. C @ 25. min |
Capillary | HP-5 | 803. | Quijano, Salamanca, et al., 2007 | 30. m/0.25 mm/0.25 μm, He, 50. C @ 4. min, 4. K/min, 250. C @ 10. min |
Capillary | DB-5 | 801. | Ruiz Perez-Cacho, Mahattanatawee, et al., 2007 | 30. m/0.32 mm/0.5 μm, 7. K/min, 265. C @ 5. min; Tstart: 40. C |
Capillary | ZB-5 | 803. | Ruiz Perez-Cacho, Mahattanatawee, et al., 2007 | 30. m/0.32 mm/0.5 μm, He, 7. K/min, 265. C @ 5. min; Tstart: 40. C |
Capillary | DB-5 | 788. | Bylaite and Meyer, 2006 | 30. m/0.25 mm/1. μm, 50. C @ 1. min, 10. K/min, 290. C @ 10. min |
Capillary | DB-1 | 778. | Osorio, Alarcon, et al., 2006 | 25. m/0.2 mm/0.33 μm, 4. K/min; Tstart: 50. C; Tend: 300. C |
Capillary | DB-5MS | 776. | Whetstine M.E.C., Drake M.A., et al., 2006 | 30. m/0.25 mm/0.25 μm, He, 40. C @ 5. min, 5. K/min, 200. C @ 45. min |
Capillary | DB-5 | 804. | Fang and Qian, 2005 | 30. m/0.32 mm/1. μm, N2, 40. C @ 2. min, 4. K/min, 230. C @ 10. min |
Capillary | HP-5 | 802. | Mahattanatawee, Goodner, et al., 2005 | 30. m/0.25 mm/0.25 μm, He, 50. C @ 5. min, 4. K/min, 250. C @ 15. min |
Capillary | HP-5 | 798. | Mahattanatawee, Goodner, et al., 2005 | 30. m/0.25 mm/0.25 μm, He, 50. C @ 5. min, 4. K/min, 250. C @ 15. min |
Capillary | HP-5 | 802. | Mahattanatawee, Goodner, et al., 2005 | 30. m/0.25 mm/0.25 μm, He, 50. C @ 5. min, 4. K/min, 250. C @ 15. min |
Capillary | HP-5MS | 802. | Pino, Mesa, et al., 2005 | 30. m/0.25 mm/0.25 μm, He, 60. C @ 2. min, 4. K/min, 250. C @ 20. min |
Capillary | DB-5 | 808. | Avsar, Karagul-Yuceer, et al., 2004 | 30. m/0.25 mm/0.25 μm, 40. C @ 5. min, 10. K/min, 200. C @ 15. min |
Capillary | DB-5 | 808. | Avsar, Karagul-Yuceer, et al., 2004 | 30. m/0.25 mm/0.25 μm, 40. C @ 5. min, 10. K/min, 200. C @ 15. min |
Capillary | ZB-5 | 800. | Bell, 2004 | 30. m/0.32 mm/0.50 μm, Helium, 7. K/min, 265. C @ 5. min; Tstart: 40. C |
Capillary | CP-Sil 8CB-MS | 805. | Hierro, de la Hoz, et al., 2004 | 60. m/0.25 mm/0.25 μm, 40. C @ 2. min, 4. K/min, 280. C @ 5. min |
Capillary | HP-5 | 802. | Siegmund, Derler, et al., 2004 | 30. m/0.25 mm/1. μm, -30. C @ 1. min, 10. K/min; Tend: 250. C |
Capillary | DB-1 | 794. | Brat, Rega, et al., 2003 | 30. m/0.25 mm/0.25 μm, He, 3. K/min, 250. C @ 20. min; Tstart: 40. C |
Capillary | CP-Sil 8CB-MS | 805. | Bruna, Hierro, et al., 2003 | 60. m/0.25 mm/0.25 μm, 40. C @ 2. min, 4. K/min, 280. C @ 5. min |
Capillary | Ultra-2 | 801. | Ceva-Antunes, Bizzo, et al., 2003 | 25. m/0.25 mm/0.33 μm, H2, 40. C @ 2. min, 3. K/min, 280. C @ 10. min |
Capillary | DB-5 | 800. | Högnadóttir and Rouseff, 2003 | 30. m/0.32 mm/0.5 μm, 7. K/min, 265. C @ 5. min; Tstart: 40. C |
Capillary | DB-5 | 797. | Högnadóttir and Rouseff, 2003 | 30. m/0.32 mm/0.5 μm, 7. K/min, 265. C @ 5. min; Tstart: 40. C |
Capillary | CP Sil 5 CB | 781. | Pino, Almora, et al., 2003 | 60. m/0.32 mm/0.25 μm, He, 60. C @ 10. min, 3. K/min, 280. C @ 60. min |
Capillary | SPB-5 | 800. | Pino, Marbot, et al., 2003 | 30. m/0.25 mm/0.25 μm, He, 60. C @ 2. min, 4. K/min, 250. C @ 20. min |
Capillary | CP Sil 5 CB | 781. | Pino, Marbot, et al., 2002 | 30. m/0.25 mm/0.25 μm, H2, 60. C @ 10. min, 2. K/min, 280. C @ 40. min |
Capillary | CP Sil 5 CB | 781. | Pino, Marbot, et al., 2002, 2 | 50. m/0.32 mm/0.4 μm, He, 60. C @ 10. min, 3. K/min, 280. C @ 60. min |
Capillary | DB-5 | 800. | Zhou, Wintersteen, et al., 2002 | 15. m/0.32 mm/0.5 μm, 30. C @ 2. min, 10. K/min, 225. C @ 20. min |
Capillary | CP-Sil 8CB-MS | 805. | Bruna, Hierro, et al., 2001 | 60. m/0.25 mm/0.25 μm, 40. C @ 2. min, 4. K/min; Tend: 280. C |
Capillary | SPB-1 | 785. | Larráyoz, Addis, et al., 2001 | 30. m/0.32 mm/4. μm, He, 45. C @ 13. min, 5. K/min, 240. C @ 5. min |
Capillary | CP Sil 5 CB | 781. | Pino and Marbot, 2001 | 50. m/0.32 mm/0.4 μm, He, 60. C @ 10. min, 3. K/min, 280. C @ 60. min |
Capillary | CP Sil 5 CB | 781. | Pino, Marbot, et al., 2001 | 50. m/0.32 mm/0.4 μm, He, 60. C @ 10. min, 3. K/min, 280. C @ 60. min |
Capillary | HP-5 | 806. | Shalit, Katzir, et al., 2001 | He, 50. C @ 1. min, 4. K/min; Column length: 30. m; Column diameter: 0.25 mm; Tend: 200. C |
Capillary | HP-5 | 802.2 | Siegmund, Derler, et al., 2001 | 30. m/0.25 mm/0.25 μm, He, 5.3 K/min, 280. C @ 5. min; Tstart: 35. C |
Capillary | DB-1 | 790. | Brat, Brillouet, et al., 2000 | 30. m/0.32 mm/0.25 μm, H2, 40. C @ 3. min, 3. K/min, 245. C @ 20. min |
Capillary | DB-5 | 802. | Moio, Piombino, et al., 2000 | 30. m/0.32 mm/1. μm, H2, 3. K/min; Tstart: 40. C; Tend: 210. C |
Capillary | DB-5 | 802. | Moio, Piombino, et al., 2000 | 30. m/0.32 mm/1. μm, H2, 3. K/min; Tstart: 40. C; Tend: 210. C |
Capillary | DB-5 | 803. | Moio, Piombino, et al., 2000 | 30. m/0.32 mm/1. μm, H2, 3. K/min; Tstart: 40. C; Tend: 210. C |
Capillary | SPB-5 | 800. | Verdier-Metz., Coulon, et al., 1998 | 60. m/0.32 mm/1. μm, He, 40. C @ 5. min, 3. K/min, 200. C @ 2. min |
Capillary | DB-5 | 802. | Moio and Addeo, 1998 | 30. m/0.32 mm/1. μm, H2, 3. K/min; Tstart: 40. C; Tend: 210. C |
Capillary | DB-5 | 802. | Moio and Addeo, 1998 | 30. m/0.32 mm/1. μm, H2, 3. K/min; Tstart: 40. C; Tend: 210. C |
Capillary | DB-5 | 802. | Moio and Addeo, 1998 | 30. m/0.32 mm/1. μm, H2, 3. K/min; Tstart: 40. C; Tend: 210. C |
Capillary | DB-5 | 802. | Moio L., Rillo L., et al., 1996 | 30. m/0.32 mm/1. μm, H2, 3. K/min; Tstart: 40. C; Tend: 220. C |
Capillary | DB-5 | 804. | Moio L., Rillo L., et al., 1996 | 30. m/0.32 mm/1. μm, H2, 3. K/min; Tstart: 40. C; Tend: 220. C |
Capillary | DB-5 | 804. | Moio L., Rillo L., et al., 1996 | 30. m/0.32 mm/1. μm, H2, 3. K/min; Tstart: 40. C; Tend: 220. C |
Capillary | OV-101 | 774. | Chisholm, Guiher, et al., 1994 | 35. C @ 3. min, 6. K/min; Column length: 15. m; Column diameter: 0.32 mm; Tend: 250. C |
Capillary | OV-101 | 791. | Chisholm, Guiher, et al., 1994 | 35. C @ 3. min, 6. K/min; Column length: 15. m; Column diameter: 0.32 mm; Tend: 250. C |
Capillary | OV-101 | 782. | Chisholm, Guiher, et al., 1994 | 35. C @ 3. min, 6. K/min; Column length: 15. m; Column diameter: 0.32 mm; Tend: 250. C |
Capillary | DB-1 | 779. | Flath, Light, et al., 1990 | 50. C @ 0.1 min, 4. K/min; Column length: 60. m; Column diameter: 0.32 mm; Tend: 250. C |
Capillary | SE-30 | 800. | Korhonen, 1985 | N2, 6. K/min; Column length: 25. m; Column diameter: 0.33 mm; Tstart: 100. C; Tend: 320. C |
Capillary | OV-1 | 785. | Schreyen, Dirinck, et al., 1976 | 1. K/min; Column length: 183. m; Column diameter: 0.762 mm; Tstart: 0. C; Tend: 230. C |
Packed | SE-30 | 787. | van den Dool and Kratz, 1963 | Celite; Tstart: 75. C; Tend: 228. C |

Van Den Dool and Kratz RI, non-polar column, custom temperature program

Column type | Active phase | I | Reference | Comment |
---|---|---|---|---|
Capillary | BPX-5 | 804. | Dharmawan, Kasapis, et al., 2007 | 30. m/0.25 mm/0.25 μm, He; Program: 35C => 4C/min => 200C => 30C/min => 300C (3min) |
Capillary | DB-5 | 802. | Escudero, Campo, et al., 2007 | Program: not specified |
Capillary | VF-5MS | 778. | Carasek and Pawliszyn, 2006 | 30. m/0.25 mm/0.25 μm, He; Program: 40C(2min) => 5C/min => 200C (2min) => 30C/min => 260C |
Capillary | VF-5MS | 778. | Carasek and Pawliszyn, 2006 | 30. m/0.25 mm/0.25 μm, He; Program: 40C(2min) => 5C/min => 200C (2min) => 30C/min => 260C |
Capillary | VF-5MS | 778. | Carasek and Pawliszyn, 2006 | 30. m/0.25 mm/0.25 μm, He; Program: 40C(2min) => 5C/min => 200C (2min) => 30C/min => 260C |
Capillary | VF-5MS | 778. | Carasek and Pawliszyn, 2006 | 30. m/0.25 mm/0.25 μm, He; Program: 40C(2min) => 5C/min => 200C (2min) => 30C/min => 260C |
Capillary | HP-5MS | 818. | Bonaiti, Irlinger, et al., 2005 | 30. m/0.25 mm/0.25 μm, He; Program: 5C(8min) => 3C/min => 20C => 10C/min => 150C(10min) |
Capillary | DB-5 | 801. | Campo, Ferreira, et al., 2005 | Program: not specified |
Capillary | SE-54 | 805. | Fritsch and Schieberle, 2005 | 30. m/0.32 mm/0.25 μm, He; Program: 35C(2min) => 40C/min => 50C(2min) => 6C/min => 180C => 20C/min => 230C(10min) |
Capillary | SE-54 | 806. | Fritsch and Schieberle, 2005 | 30. m/0.32 mm/0.25 μm, He; Program: 35C(2min) => 40C/min => 50C(2min) => 6C/min => 180C => 20C/min => 230C(10min) |
Capillary | DB-5 | 803. | Wang, Finn, et al., 2005 | 30. m/0.32 mm/1. μm, He; Program: 40C(2min) => 5C/min => 100C => 4C/min => 230C (10min) |
Capillary | DB-5 | 807. | Wang, Finn, et al., 2005 | 30. m/0.32 mm/1. μm, He; Program: 40C(2min) => 5C/min => 100C => 4C/min => 230C (10min) |
Capillary | DB-5 | 798. | Boscaini, van Ruth, et al., 2003 | 60. m/0.32 mm/1. μm, He; Program: 40C(4min) => 2C/min => 90C => 4C/min => 130C 8C/min => 250C |
Capillary | DB-5 | 770. | Klesk and Qian, 2003 | 30. m/0.25 mm/0.25 μm, He; Program: 40C(2min) => 5C/min => 100C => 4C/min => 230C(10min) |
Capillary | DB-5 | 798. | Klesk and Qian, 2003, 2 | 30. m/0.32 mm/1. μm, He; Program: 40C(2min) => 2C/min => 100C => 10C/min => 230C (5min) |
Capillary | DB-5 | 805. | Mayr, van Ruth, et al., 2003 | 60. m/0.32 mm/1. μm, He; Program: 40 C(4min) => 2C/min => 90C => 4C/min => 130C => 8C/min => 250C |
Capillary | CP Sil 8 CB | 805. | Fuhrmann and Grosch, 2002 | 25. m/0.32 mm/0.25 μm, He; Program: 35C(2min) => 5C/min => 170C => 20C/min => 240C (10min) |
Capillary | RTX-5 | 805. | Fuhrmann and Grosch, 2002 | Program: not specified |
Capillary | DB-5 | 801. | Zehentbauer and Reineccius, 2002 | 30. m/0.25 mm/0.25 μm, He; Program: 35 C (2 min) 40 C/min -> 50 C (2 min) 4 C/min -> 230 C |
Capillary | DB-5 | 803. | Beaulieu and Grimm, 2001 | 30. m/0.25 mm/0.25 μm, He; Program: 50C (1min) => 5C/min => 100C => 10C/min => 250C (9min) |
Capillary | DB-5MS | 798. | Boulanger and Crouzet, 2001 | 30. m/0.25 mm/0.25 μm, H2; Program: 40C (5min) => 2C/min => 200C => 5C/min => 250C (15min) |
Capillary | HP-5 | 800. | Isidorov, Krajewska, et al., 2001 | 30. m/0.25 mm/0.25 μm, He; Program: 50C => 6C/min => 100C => 4C/min => 280C |
Capillary | DB-5 | 803. | Munk, Munch, et al., 2000 | 30. m/0.32 mm/0.25 μm; Program: 40C(2min) => 40C/min => 50C (1min) => 6C/min => 180C => 10C/min => 240C (5min) |
Capillary | DB-5 | 803. | Munk, Munch, et al., 2000 | 30. m/0.32 mm/0.25 μm; Program: 40C(2min) => 40C/min => 50C (1min) => 6C/min => 180C => 10C/min => 240C (5min) |
Capillary | SE-54 | 802. | Buettner and Schieberle, 1999 | 30. m/0.32 mm/0.25 μm, He; Program: 35C (2min) => 40C/min => 50C (2min) => 6C/min => 180C => 10C/min => 230C (10min) |
Capillary | BPX-5 | 801. | Bauchot, Mottram, et al., 1998 | 50. m/0.32 mm/0.50 μm, He; Program: 0 0C (8 min) -> (1 min) -> 50 0C (2 min) 2.5 0C/min -> 100 0C 6 0C/min -> 250 0C |
Capillary | SE-54 | 802. | Hinterholzer and Schieberie, 1998 | 30. m/0.32 mm/0.25 μm, He; Program: 35C(2min) => 40C/min => 50C(2min) => 6C/min => 180C => 10C/min => 230C(10min) |

Van Den Dool and Kratz RI, polar column, temperature ramp

Column type | Active phase | I | Reference | Comment |
---|---|---|---|---|
Capillary | DB-Wax | 1028. | Botelho, Caldeira, et al., 2007 | 30. m/0.25 mm/0.25 μm, He, 50. C @ 2. min, 3.5 K/min, 180. C @ 25. min |
Capillary | Innowax | 1036. | Botelho, Caldeira, et al., 2007 | 30. m/0.25 mm/0.25 μm, H2, 45. C @ 5. min, 3.5 K/min, 210. C @ 20. min |
Capillary | FFAP | 1048. | Lozano P.R., Miracle E.R., et al., 2007 | 30. m/0.25 mm/0.25 μm, He, 35. C @ 5. min, 10. K/min, 225. C @ 25. min |
Capillary | DB-Wax | 1035. | Pozo-Bayon M.A., Ruiz-Rodriguez A., et al., 2007 | 30. m/0.25 mm/0.5 μm, He, 40. C @ 5. min, 4. K/min, 250. C @ 15. min |
Capillary | DB-Wax | 1035. | Pozo-Bayon M.A., Ruiz-Rodriguez A., et al., 2007 | 30. m/0.25 mm/0.5 μm, He, 40. C @ 5. min, 4. K/min, 250. C @ 15. min |
Capillary | DB-Wax | 1041. | Ruiz Perez-Cacho, Mahattanatawee, et al., 2007 | 30. m/0.32 mm/0.5 μm, He, 7. K/min, 240. C @ 5. min; Tstart: 40. C |
Capillary | Supelcowax-10 | 1049. | Arena, Guarrera, et al., 2006 | 30. m/0.32 mm/0.5 μm, He, 70. C @ 7. min, 4. K/min, 220. C @ 20. min |
Capillary | DB-Wax Etr | 1061. | Aubert C. and Pitrat M., 2006 | 30. m/0.25 mm/0.25 μm, He, 40. C @ 3. min, 5. K/min, 250. C @ 15. min |
Capillary | DB-Wax | 1041. | Gurbuz O., Rouseff J.M., et al., 2006 | 60. m/0.25 mm/0.25 μm, He, 7. K/min, 265. C @ 5. min; Tstart: 40. C |
Capillary | DB-Wax | 1033. | Gurbuz O., Rouseff J.M., et al., 2006 | 30. m/0.32 mm/0.5 μm, He, 7. K/min, 265. C @ 5. min; Tstart: 40. C |
Capillary | CP-Wax 52CB | 1039. | Kourkoutas, Elmore, et al., 2006 | 60. m/0.25 mm/0.25 μm, He, 4. K/min; Tstart: 40. C; Tend: 250. C |
Capillary | DB-Wax | 1027. | Osorio, Alarcon, et al., 2006 | 30. m/0.25 mm/0.25 μm, He, 50. C @ 4. min, 4. K/min, 220. C @ 20. min |
Capillary | DB-Wax | 1052. | Petka, Ferreira, et al., 2006 | 30. m/0.32 mm/0.5 μm, 40. C @ 3. min, 5. K/min, 200. C @ 8. min |
Capillary | DB-Wax | 1048. | Berlinet, Ducruet, et al., 2005 | 30. m/0.25 mm/0.25 μm, He, 3. K/min, 250. C @ 20. min; Tstart: 40. C |
Capillary | Stabilwax | 1048. | Fang and Qian, 2005 | 30. m/0.32 mm/1. μm, N2, 40. C @ 2. min, 4. K/min, 230. C @ 10. min |
Capillary | DB-Wax | 1067. | Malliaa, Fernandez-Garcia, et al., 2005 | 60. m/0.32 mm/1. μm, He, 45. C @ 1. min, 5. K/min, 250. C @ 12. min |
Capillary | DB-Wax | 1073. | Malliaa, Fernandez-Garcia, et al., 2005 | 60. m/0.32 mm/1. μm, He, 45. C @ 1. min, 5. K/min, 250. C @ 12. min |
Capillary | Supelcowax-10 | 1069. | Riu-Aumatell, Lopez-Tamames, et al., 2005 | 30. m/0.25 mm/0.25 μm, He, 60. C @ 5. min, 3. K/min, 240. C @ 10. min |
Capillary | DB-Wax | 1000. | Whetstine, Cadwallader, et al., 2005 | 30. m/0.25 mm/0.25 μm, 40. C @ 3. min, 10. K/min, 200. C @ 20. min |
Capillary | DB-Wax | 1037. | Aubert and Bourger, 2004 | 30. m/0.25 mm/0.25 μm, H2, 40. C @ 3. min, 3. K/min, 250. C @ 20. min |
Capillary | DB-FFAP | 1029. | Avsar, Karagul-Yuceer, et al., 2004 | 15. m/0.32 mm/0.25 μm, He, 35. C @ 5. min, 10. K/min, 225. C @ 15. min |
Capillary | DB-FFAP | 1052. | Avsar, Karagul-Yuceer, et al., 2004 | 15. m/0.32 mm/0.25 μm, He, 35. C @ 5. min, 10. K/min, 225. C @ 15. min |
Capillary | DB-Wax | 1022. | Avsar, Karagul-Yuceer, et al., 2004 | 30. m/0.25 mm/0.25 μm, 40. C @ 5. min, 10. K/min, 200. C @ 15. min |
Capillary | DB-Wax | 1022. | Avsar, Karagul-Yuceer, et al., 2004 | 30. m/0.25 mm/0.25 μm, 40. C @ 5. min, 10. K/min, 200. C @ 15. min |
Capillary | DB-Wax | 1001. | Bell, 2004 | 30. m/0.32 mm/0.50 μm, Helium, 7. K/min, 240. C @ 5. min; Tstart: 40. C |
Capillary | ZB-Wax | 1023. | Ledauphin, Saint-Clair, et al., 2004 | 30. m/0.25 mm/0.15 μm, He, 35. C @ 10. min, 1.8 K/min, 220. C @ 10. min |
Capillary | DB-Wax | 1041. | Rega, Fournier, et al., 2004 | 30. m/0.32 mm/0.5 μm, He, 40. C @ 5. min, 5. K/min; Tend: 240. C |
Capillary | DB-Wax | 1023. | Varming, Andersen, et al., 2004 | 30. m/0.25 mm/0.25 μm, He, 40. C @ 10. min, 6. K/min, 240. C @ 25. min |
Capillary | DB-Wax | 1030. | Varming, Petersen, et al., 2004 | 30. m/0.25 mm/0.25 μm, He, 40. C @ 10. min, 6. K/min, 240. C @ 25. min |
Capillary | DB-Wax | 1021. | Brat, Rega, et al., 2003 | 30. m/0.25 mm/0.25 μm, He, 3. K/min, 250. C @ 20. min; Tstart: 40. C |
Capillary | DB-Wax | 1036. | Hayata, Sakamoto, et al., 2003 | He, 40. C @ 10. min, 3. K/min, 220. C @ 30. min; Column length: 60. m; Column diameter: 0.25 mm |
Capillary | DB-Wax | 1037. | Högnadóttir and Rouseff, 2003 | 30. m/0.32 mm/0.5 μm, 7. K/min, 240. C @ 5. min; Tstart: 40. C |
Capillary | AT-Wax | 1021. | Pino, Almora, et al., 2003 | 60. m/0.32 mm/0.25 μm, He, 65. C @ 10. min, 2. K/min, 250. C @ 60. min |
Capillary | DB-Wax | 1041. | Rega, Fournier, et al., 2003 | 30. m/0.32 mm/0.5 μm, 35. C @ 5. min, 5. K/min, 240. C @ 5. min |
Capillary | DB-Wax | 1057. | Valim, Rouseff, et al., 2003 | 30. m/0.32 mm/0.5 μm, 7. K/min, 240. C @ 5. min; Tstart: 40. C |
Capillary | AT-Wax | 1025. | Pino, Marbot, et al., 2002, 2 | 60. m/0.32 mm/0.25 μm, He, 65. C @ 10. min, 2. K/min, 250. C @ 60. min |
Capillary | DB-FFAP | 1020. | Zhou, Wintersteen, et al., 2002 | 15. m/0.32 mm/0.25 μm, 30. C @ 2. min, 10. K/min, 225. C @ 20. min |
Capillary | AT-Wax | 1024. | Pino and Marbot, 2001 | 60. m/0.32 mm/0.25 μm, He, 65. C @ 10. min, 2. K/min, 250. C @ 60. min |
Capillary | AT-Wax | 1025. | Pino, Marbot, et al., 2001 | 60. m/0.32 mm/0.25 μm, He, 65. C @ 10. min, 2. K/min, 250. C @ 60. min |
Capillary | DB-Wax | 1040.4 | Siegmund, Derler, et al., 2001 | 30. m/0.32 mm/0.5 μm, He, 1.1 K/min, 250. C @ 10. min; Tstart: 35. C |
Capillary | Supelcowax-10 | 1039. | Chung, 2000 | 60. m/0.25 mm/0.25 μm, He, 2. K/min, 195. C @ 90. min; Tstart: 35. C |
Capillary | Supelcowax-10 | 1039. | Chung, 1999 | 60. m/0.25 mm/0.25 μm, He, 35. C @ 5. min, 2. K/min, 195. C @ 90. min |
Capillary | DB-FFAP | 1021. | Guillard, le Quere, et al., 1997 | H2, 3. K/min; Column length: 30. m; Column diameter: 0.32 mm; Tstart: 40. C; Tend: 220. C |
Capillary | DB-FFAP | 1023. | Guillard, le Quere, et al., 1997 | H2, 3. K/min; Column length: 30. m; Column diameter: 0.32 mm; Tstart: 40. C; Tend: 220. C |
Capillary | DB-Wax | 1044. | Shimoda, Peralta, et al., 1996 | 60. m/0.25 mm/0.25 μm, He, 3. K/min; Tstart: 50. C; Tend: 230. C |
Capillary | DB-Wax | 1037. | Iwaoka, Hagi, et al., 1994 | He, 40. C @ 5. min, 2. K/min; Column length: 30. m; Column diameter: 0.25 mm; Tend: 200. C |
Capillary | DB-Wax | 1040. | Stashenko, Macku, et al., 1992 | He, 35. C @ 5. min, 3. K/min; Column length: 60. m; Column diameter: 0.25 mm; Tend: 180. C |
Capillary | DB-Wax | 1032. | Umano, Hagi, et al., 1992 | He, 40. C @ 10. min, 2. K/min; Column length: 30. m; Column diameter: 0.25 mm; Tend: 200. C |
Capillary | Carbowax 20M | 1025. | Suárez and Duque, 1991 | 2. K/min; Column length: 25. m; Column diameter: 0.31 mm; Tstart: 50. C; Tend: 200. C |
Capillary | Carbowax 20M | 1031. | Suárez and Duque, 1991 | 2. K/min; Column length: 25. m; Column diameter: 0.31 mm; Tstart: 50. C; Tend: 200. C |
Capillary | OV-351 | 1057. | Korhonen, 1985 | N2, 6. K/min; Column length: 25. m; Column diameter: 0.32 mm; Tstart: 100. C; Tend: 230. C |
Capillary | Carbowax 20M | 1025. | Chen, Kuo, et al., 1982 | He, 50. C @ 10. min, 1. K/min; Tend: 160. C |
Packed | Carbowax 20M | 1032. | van den Dool and Kratz, 1963 | Celite 545, 4.6 K/min; Tstart: 75. C; Tend: 228. C |

Van Den Dool and Kratz RI, polar column, custom temperature program

Column type | Active phase | I | Reference | Comment |
---|---|---|---|---|
Capillary | Supelcowax-10 | 1040. | Bianchi, Cantoni, et al., 2007 | 30. m/0.25 mm/0.25 μm; Program: 35C(8min) => 4C/min => 60C => 6C/min => 160C => 20C/min => 220C(1min) |
Capillary | Supelcowax-10 | 1040. | Bianchi, Careri, et al., 2007 | 30. m/0.25 mm/0.25 μm, He; Program: 35C(8min) => 4C/min => 60C => 6C/min => 160C => 20C/min => 200C(1min) |
Capillary | Supelcowax-10 | 1046. | Bianchi, Careri, et al., 2007 | 30. m/0.25 mm/0.25 μm, He; Program: 35C(8min) => 4C/min => 60C => 6C/min => 160C => 20C/min => 200C(1min) |
Capillary | Supelcowax-10 | 1040. | Bianchi, Careri, et al., 2007 | 30. m/0.25 mm/0.25 μm, He; Program: 35C(8min) => 4C/min => 60C => 6C/min => 160C => 20C/min => 200C(1min) |
Capillary | DB-Wax | 1055. | Escudero, Campo, et al., 2007 | 30. m/0.32 mm/0.5 μm, H2; Program: 40C(5min) => 4C/min => 100C6C/min => 136C => 3C/min => 220C (10min) |
Capillary | CP-Wax 52CB | 1034. | Romeo, Ziino, et al., 2007 | 60. m/0.25 mm/0.25 μm, He; Program: 45C(5min) => 10C/min => 80C => 2C/min => 240C |
Capillary | DB-Wax | 1034. | Mehinagic, Royer, et al., 2006 | 30. m/0.25 mm/0.5 μm, He; Program: 40C => 5C/min => 60C(30min) => 5C/min => 240C |
Capillary | DB-Wax | 1032. | Mehinagic, Royer, et al., 2006 | 30. m/0.25 mm/0.5 μm, He; Program: 40C => 5C/min => 60C(30min) => 5C/min => 240C |
Capillary | DB-Wax | 1044. | Selli, Canbas, et al., 2006 | 30. m/0.32 mm/0.5 μm, H2; Program: 60C(3min) => 2C/min => 220C => 3C/min => 245C (20min) |
Capillary | SOLGel-Wax | 1028. | Aubert, Baumann, et al., 2005 | 30. m/0.25 mm/0.25 μm, He; Program: 35C(5min) => 3C/min => 150C => 5C/min => 250C (10min) |
Capillary | SOLGel-Wax | 1028. | Aubert, Baumann, et al., 2005 | 30. m/0.25 mm/0.25 μm, He; Program: 35C(5min) => 3C/min => 150C => 5C/min => 250C(10 min) |
Capillary | DB-Wax | 1056. | Campo, Ferreira, et al., 2005 | 30. m/0.32 mm/0.5 μm, H2; Program: 40C(5min) => 4C/min => 100C => 6C/min => 200C |
Capillary | FFAP | 1021. | Fritsch and Schieberle, 2005 | 30. m/0.32 mm/0.25 μm, He; Program: 35C(2min) => 40C/min => 60C(2min) => 6C/min => 180C => 20C/min => 230C(10min) |
Capillary | Supelcowax-10 | 1034. | Howard, Mike, et al., 2005 | 30. m/0.25 mm/0.25 μm, He; Program: 35C(8min) => 3C/min => 134C => 20C/min => 250C(3.2min) |
Capillary | Stabilwax | 1042. | Wang, Finn, et al., 2005 | 30. m/0.32 mm/1. μm, He; Program: 40C(2min) => 5C/min => 100C => 4C/min => 230C (10min) |
Capillary | Stabilwax | 1056. | Wang, Finn, et al., 2005 | 30. m/0.32 mm/1. μm, He; Program: 40C(2min) => 5C/min => 100C => 4C/min => 230C (10min) |
Capillary | DB-Wax | 1022. | Ferrari, Lablanquie, et al., 2004 | 60. m/0.25 mm/0.25 μm, He; Program: 35C(0.7min) => 20C/min => 70C => 4C/min => 240C |
Capillary | Stabilwax | 1047. | Klesk, Qian, et al., 2004 | 30. m/0.32 mm/1. μm, He; Program: 40C (2min) => 5C/min => 100C => 4C/min => 230C (10min) |
Capillary | CP-Wax 52CB | 1037. | Verzera, Ziino, et al., 2004 | 60. m/0.25 mm/0.25 μm, He; Program: 45C(5min) => 10C/min => 80C => 2C/min => 240C |
Capillary | Stabilwax | 1038. | Klesk and Qian, 2003 | 30. m/0.32 mm/1. μm, He; Program: 40C(2min) => 5C/min => 100C => 4C/min => 230C(10min) |
Capillary | DB-Wax | 1041. | Klesk and Qian, 2003, 2 | 30. m/0.25 mm/0.5 μm, He; Program: 40C(2min) => 2C/min => 100C => 10C/min => 230C (5min) |
Capillary | Supelcowax-10 | 1041. | da Porto, Pizzale, et al., 2003 | 30. m/0.32 mm/0.3 μm; Program: 60C(8min) => 8C/min => 170C => 13C/min => 240C(20min) |
Capillary | FFAP | 1025. | Fuhrmann and Grosch, 2002 | 25. m/0.32 mm/0.3 μm, He; Program: 35C(2min) => 5C/min => 170C => 20C/min => 240C (10min) |
Capillary | DB-Wax | 1043. | Boulanger and Crouzet, 2001 | 30. m/0.25 mm/0.25 μm, H2; Program: 60C (3min) => 2C/min => 220C => 5C/min => 250C (15min) |
Capillary | Innowax | 1044. | Larráyoz, Addis, et al., 2001 | 60. m/0.22 mm/0.25 μm, He; Program: 35C (1min) => 3C/min => 170C => 4C/min => 200C (20min) |
Capillary | DB-FFAP | 1041. | Munk, Johansen, et al., 2001 | 30. m/0.32 mm/0.25 μm; Program: 40C(2min) => 40C/min => 60C (2min) => 6C/min => 180C => 10C/min => 240C(5min) |
Capillary | DB-FFAP | 1037. | Munk, Munch, et al., 2000 | 30. m/0.32 mm/0.25 μm; Program: 40C(2min) => 40C/min => 60C (2min) => 6C/min => 180C => 10C/min => 240C (5min) |
Capillary | DB-FFAP | 1035. | Munk, Munch, et al., 2000 | 30. m/0.32 mm/0.25 μm; Program: 40C(2min) => 40C/min => 60C (2min) => 6C/min => 180C => 10C/min => 240C (5min) |
Capillary | FFAP | 1028. | Buettner and Schieberle, 1999 | 30. m/0.32 mm/0.25 μm, He; Program: 35C (2min) => 40C/min => 60C (2min) => 6C/min => 180C => 10C/min => 230C (10min) |
Capillary | HP-Innowax | 1048. | Iversen, Jakobsen, et al., 1998 | 60. m/0.25 mm/0.25 μm, He; Program: 32C(1.5min) => 3C/min => 40C (10min) => 3C/min => 200C (10min) |
Capillary | Supelcowax-10 | 1038. | Cadwallader and Xu, 1994 | 60. m/0.25 mm/0.25 μm, He; Program: 40C => (6C/min) => 80C(6min) => (15C/min) => 200C(10min) |
Capillary | FFAP | 1021. | Yasuhara, 1987 | 50. m/0.25 mm/0.25 μm, He; Program: 20C (5min) => 2C/min => 70C => 4C/min => 210C |

Normal alkane RI, non-polar column, isothermal

Column type | Active phase | Temperature (C) | I | Reference | Comment |
---|---|---|---|---|---|
Packed | SE-30 | 70. | 792. | Yabumoto, Jennings, et al., 1977 |

Normal alkane RI, non-polar column, temperature ramp

Column type | Active phase | I | Reference | Comment |
---|---|---|---|---|
Capillary | VF-5 MS | 803. | Leffingwell and Alford, 2011 | 60. m/0.32 mm/0.25 μm, Helium, 2. K/min, 260. C @ 28. min; Tstart: 30. C |
Capillary | VF-5 MS | 804. | Leffingwell and Alford, 2011 | 60. m/0.32 mm/0.25 μm, Helium, 2. K/min, 260. C @ 28. min; Tstart: 30. C |
Capillary | DB-1 | 784. | Misharina T., 2011 | 50. m/0.32 mm/0.25 μm, Helium, 8. K/min; Tstart: 60. C; Tend: 250. C |
Capillary | HP-5 MS | 801. | Pino, Marquez, et al., 2010 | 30. m/0.32 mm/0.25 μm, Helium, 50. C @ 2. min, 4. K/min, 240. C @ 10. min |
Capillary | SE-54 | 803. | Laselan, Buettner, et al., 2009 | 30. m/0.32 mm/0.25 μm, 0. C @ 2. min, 6. K/min; Tend: 200. C |
Capillary | DB-1 | 774. | Kumazawa, Itobe, et al., 2008 | 30. m/0.25 mm/0.25 μm, He, 5. K/min; Tstart: 30. C; Tend: 210. C |
Capillary | RTX-5 | 807. | Setkova, Risticevic, et al., 2007 | 10. m/0.18 mm/0.2 μm, He, 40. C @ 0.5 min, 50. K/min, 275. C @ 0.5 min |
Capillary | Elite-5MS | 802. | Tava, Pecetti, et al., 2007 | 30. m/0.32 mm/0.5 μm, He, 40. C @ 5. min, 4. K/min, 280. C @ 10. min |
Capillary | DB-5 | 800. | Xu, Fan, et al., 2007 | 30. m/0.32 mm/0.25 μm, He, 40. C @ 2. min, 4. K/min, 250. C @ 5. min |
Capillary | DB-1 | 783. | Chen, Sheu, et al., 2006 | Nitrogen, 40. C @ 1. min, 2. K/min, 200. C @ 9. min; Column length: 60. m; Column diameter: 0.25 mm |
Capillary | DB-5 | 800. | Fan and Qian, 2006 | 30. m/0.32 mm/1. μm, He, 40. C @ 2. min, 4. K/min, 250. C @ 15. min |
Capillary | DB-5 | 800. | Fan and Qian, 2006, 2 | 30. m/0.32 mm/1. μm, N2, 40. C @ 2. min, 6. K/min, 230. C @ 15. min |
Capillary | HP-5 | 800. | Isidorov, Purzynska, et al., 2006 | 30. m/0.25 mm/0.25 μm, He, 35. C @ 5. min, 3. K/min; Tend: 200. C |
Capillary | DB-5 | 803. | de Souza, Vásquez, et al., 2006 | He, 35. C @ 3. min, 6. K/min; Column length: 13.5 m; Column diameter: 0.32 mm; Tend: 225. C |
Capillary | DB-5 | 800. | Fan and Qian, 2005 | 30. m/0.32 mm/0.25 μm, N2, 40. C @ 2. min, 4. K/min, 250. C @ 5. min |
Capillary | SPB-5 | 800. | Pino, Marbot, et al., 2005 | 30. m/0.25 mm/0.25 μm, He, 60. C @ 2. min, 4. K/min, 250. C @ 20. min |
Capillary | RTX-5 | 806. | Tokitomo, Steihaus, et al., 2005 | 60. m/0.53 mm/1.5 μm, Helium, 6. K/min; Tstart: 0. C; Tend: 240. C |
Capillary | HP-5 | 778. | Azodanlou, Darbellay, et al., 2003 | 25. m/0.2 mm/0.33 μm, He, 4. K/min, 190. C @ 5. min; Tstart: 40. C |
Capillary | SPB-5 | 804. | Ledauphin, Guichard, et al., 2003 | 30. m/0.32 mm/0.25 μm, He, 40. C @ 1. min, 5. K/min, 220. C @ 20. min |
Capillary | OV-101 | 788. | Murakami, Goldstein, et al., 2003 | 12. m/0.32 mm/0.32 μm, 35. C @ 3. min, 6. K/min; Tend: 225. C |
Capillary | DB-5 | 798. | Pino, Marbot, et al., 2003, 2 | 30. m/0.25 mm/0.25 μm, H2, 60. C @ 10. min, 4. K/min, 280. C @ 40. min |
Capillary | OV-101 | 788. | Bloss, Acree, et al., 2002 | 35. C @ 5. min, 6. K/min; Column length: 10. m; Column diameter: 0.25 mm; Tend: 225. C |
Capillary | DB-5 | 797. | Lin, Rouseff, et al., 2002 | 30. m/0.32 mm/0.25 μm, He, 7. K/min; Tstart: 40. C; Tend: 290. C |
Capillary | DB-5 | 799. | Joffraud, Leroi, et al., 2001 | 60. m/0.32 mm/1. μm, He, 40. C @ 5. min, 3. K/min; Tend: 200. C |
Capillary | RSL-200 | 783. | Ngassoum, Jirovetz, et al., 2001 | 30. m/0.32 mm/0.25 μm, H2, 40. C @ 5. min, 6. K/min, 280. C @ 5. min |
Capillary | DB-5MS | 803. | Suriyaphan, Drake, et al., 2001 | 30. m/0.32 mm/0.25 μm, He, 40. C @ 5. min, 5. K/min, 195. C @ 40. min |
Capillary | DB-5 | 804. | Kotseridis and Baumes, 2000 | 30. m/0.32 mm/0.5 μm, H2, 60. C @ 3. min, 3. K/min, 245. C @ 20. min |
Capillary | OV-101 | 780. | Tamura, Boonbumrung, et al., 2000 | Nitrogen, 40. C @ 10. min, 2. K/min; Column length: 50. m; Column diameter: 0.25 mm; Tend: 200. C |
Capillary | BP-5 | 812. | Lopez, Ferreira, et al., 1999 | 50. m/0.32 mm/1. μm, He, 40. C @ 5. min, 2. K/min; Tend: 190. C |
Capillary | DB-5 MS | 802. | Suriyaphan, Drake, et al., 1999 | 60. m/0.32 mm/0.25 μm, Helium, 40. C @ 5. min, 3. K/min, 200. C @ 30. min |
Capillary | HP-1 | 780. | Ong, Acree, et al., 1998 | 4. K/min; Column length: 25. m; Column diameter: 0.32 mm; Tstart: 35. C; Tend: 250. C |
Capillary | OV-101 | 785. | Roberts and Acree, 1996 | 35. C @ 3. min, 6. K/min; Column length: 12. m; Column diameter: 0.32 mm; Tend: 225. C |
Capillary | OV-101 | 790. | Chisholm, Guiher, et al., 1995 | He, 35. C @ 3. min, 6. K/min; Column length: 15. m; Column diameter: 0.32 mm; Tend: 250. C |
Capillary | HP-5 | 799. | Larsen and Frisvad, 1995 | 35. C @ 2. min, 6. K/min; Tend: 200. C |
Capillary | OV-101 | 784. | Egolf and Jurs, 1993 | 2. K/min; Column length: 50. m; Column diameter: 0.22 mm; Tstart: 80. C; Tend: 200. C |
Capillary | DB-5 | 802. | Moio, Dekimpe, et al., 1993 | 30. m/0.32 mm/1. μm, H2, 3. K/min; Tstart: 40. C; Tend: 220. C |
Capillary | DB-5 | 804. | Moio, Dekimpe, et al., 1993 | 30. m/0.32 mm/1. μm, H2, 3. K/min; Tstart: 40. C; Tend: 220. C |
Capillary | DB-5 | 804. | Moio, Langlois, et al., 1993 | 30. m/0.32 mm/1. μm, H2, 40. C @ 5. min, 5. K/min; Tend: 220. C |
Capillary | DB-5 | 799. | Shimoda, Shibamoto, et al., 1993 | 60. m/0.25 mm/0.25 μm, He, 40. C @ 2. min, 3. K/min; Tend: 200. C |
Capillary | DB-1 | 782. | Peppard, 1992 | 30. m/0.25 mm/1.0 μm, He, 3. K/min, 250. C @ 30. min; Tstart: 40. C |
Capillary | DB-1 | 791. | Peppard, 1992 | 30. m/0.25 mm/1.0 μm, He, 3. K/min, 250. C @ 30. min; Tstart: 40. C |
Capillary | DB-1 | 780. | Shiota, 1991 | 60. m/0.25 mm/0.25 μm, He, 3. K/min; Tstart: 50. C; Tend: 240. C |
Capillary | DB-1 | 784. | Shiota, 1991 | 60. m/0.25 mm/0.25 μm, He, 3. K/min; Tstart: 50. C; Tend: 240. C |
Capillary | OV-101 | 785. | Anker, Jurs, et al., 1990 | 2. K/min; Column length: 50. m; Column diameter: 0.28 mm; Tstart: 80. C; Tend: 200. C |
Capillary | DB-1 | 781. | Binder and Flath, 1989 | 50. C @ 0.1 min, 4. K/min, 250. C @ 5. min; Column length: 60. m; Column diameter: 0.32 mm |
Capillary | DB-1 | 788. | Takeoka and Butter, 1989 | He, 30. C @ 4. min, 2. K/min; Column length: 60. m; Column diameter: 0.32 mm; Tend: 210. C |
Capillary | DB-1 | 789. | Takeoka and Butter, 1989 | He, 30. C @ 4. min, 2. K/min; Column length: 60. m; Column diameter: 0.32 mm; Tend: 210. C |
Capillary | SE-30 | 785. | Hackett, Gibbon, et al., 1985 | He, 20. C @ 4. min, 2. K/min, 260. C @ 16. min; Column length: 50. m; Column diameter: 0.25 mm |
Capillary | SE-30 | 785. | Dirinck, de Pooter, et al., 1981 | N2, 2. K/min; Column length: 200. m; Column diameter: 0.6 mm; Tstart: 20. C; Tend: 220. C |
Capillary | SE-30 | 782. | Heydanek and McGorrin, 1981 | He, 40. C @ 3. min, 3. K/min; Column length: 50. m; Column diameter: 0.5 mm; Tend: 170. C |
Capillary | SE-30 | 794. | Alves and Jennings, 1979 | Helium, 2. K/min; Tstart: 70. C; Tend: 170. C |
Packed | Apiezon L | 796. | Dahlmann, Köser, et al., 1979 | Chromosorb G-AW-DMCS, 10. K/min; Column length: 2. m; Tstart: 25. C |
Capillary | OV-1 | 787. | Schreyen, Dirinck, et al., 1979 | N2, 1. K/min; Column length: 183. m; Column diameter: 0.762 mm; Tstart: 0. C; Tend: 230. C |

Normal alkane RI, non-polar column, custom temperature program

Column type | Active phase | I | Reference | Comment |
---|---|---|---|---|
Capillary | CP-Sil 5 CB | 774. | Collin, Nizet, et al., 2012 | 50. m/0.32 mm/1.20 μm, Nitrogen; Program: 36 0C 20 0C/min -> 85 0C 1 0C/min -> 145 0C 3 0C/min -> 250 0C (30 min) |
Capillary | CP-Sil 5 CB | 770. | Collin, Nizet, et al., 2012, 2 | 50. m/0.32 mm/1.20 μm, Nitrogen; Program: 36 0C 20 0C/min -> 85 0C 1 0C/min -> 145 0C 3 0C/min -> 250 0C |
Capillary | HP-5 | 807. | Fang, Pu, et al., 2012 | 30. m/0.25 mm/0.25 μm, Helium; Program: 30 0C (1 min) 2 0C/min -> 100 0C (5 min) 5 0C/min -> 170 0C |
Capillary | Siloxane, 5 % Ph | 801. | VOC BinBase, 2012 | Program: not specified |
Capillary | CP-Sil 8 CB | 803. | de Freitas, Garruti, et al., 2011 | 30. m/0.25 mm/0.25 μm, Hydrogen; Program: 30 0C 3 0C/min -> 150 0C 20 0C/min -> 220 0C |
Capillary | DB-5 | 798. | Miyazaki, Plotto, et al., 2011 | 60. m/0.25 mm/1.00 μm, Helium; Program: 40 0C 4 0C/min -> 230 0C 100 0C/min -> 260 0C (11.7 min) |
Capillary | Polydimethyl siloxane, 5 % phenyl | 801. | Skogerson, Wohlgemuth, et al., 2011 | Program: not specified |
Capillary | CP Sil-5 CB | 770. | Bailly and Collin, 2010 | 50. m/0.32 mm/1.20 μm, Nitrogen; Program: 36 0C 20 0C/min -> 85 0C 1 0C/min -> 145 0C 3 0C/min -> 250 0C |
Capillary | HP-5 MS | 804. | Pino, Marquez, et al., 2010 | 30. m/0.32 mm/0.25 μm, Helium; Program: not specified |
Capillary | DB-5 | 800. | San-Juan, Petka, et al., 2010 | 30. m/0.32 mm/0.50 μm, Hydrogen; Program: 40 0C (5 min) 4 0C/min -> 100 0C 6 0C/min -> 220 0C (20 min) |
Capillary | CP-Sil 5 CB | 770. | Bailly, Jerkovic, et al., 2009 | 50. m/0.32 mm/1.20 μm, Nitrogen; Program: 36 0C 20 0C/min -> 85 0C 1 0C -> 145 0C 3 0C/min -> 250 0C |
Capillary | HP-5 MS | 802. | Fan, Lu, et al., 2009 | 30. m/0.25 mm/0.25 μm, Helium; Program: 40 0C (3 min) 3 0C/min -> 160 0C (2 min) 8 0C/min -> 220 0C (3 min) |
Capillary | BPX-5 | 803. | Ortiz, Echeverra, et al., 2009 | 30. m/0.25 mm/0.25 μm, Helium; Program: 70 0C (1 min) 3 0C/min -> 142 0C 5 0C/min -> 225 0C (10 min) |
Capillary | HP-5 | 804. | Rotsatschakul, Visesanguan, et al., 2009 | 60. m/0.25 mm/0.25 μm, Helium; Program: 30 0C (2 min) 2 0Cmin -> 60 0C 10 0C/min -> 100 0C 20 0C/min -> 140 0C 10 0C/min -> 200 0C (10 min) |
Capillary | HP-5 | 796. | Qiao, Xie, et al., 2008 | 30. m/0.25 mm/0.25 μm, Helium; Program: 40 0C (3 min) 3 0C/min -> 160 0C (2 min) 8 0C/min -> 220 0C (3 min) |
Capillary | HP-5 | 800. | Qiao, Xie, et al., 2008 | 30. m/0.25 mm/0.25 μm, Helium; Program: not specified |
Capillary | HP-5 | 802. | Zhao, Li, et al., 2008 | 30. m/0.25 mm/0.25 μm; Program: 40 0C (2 min) 5 0C/min -> 80 0C 7 oC/min -> 160 0C 9 0C/min -> 200 0C 20 0C/min -> 280 0C (10 min) |
Capillary | HP-5 | 800. | Zhao, Li, et al., 2008 | 30. m/0.25 mm/0.25 μm; Program: not specified |
Capillary | DB-5 | 803. | Beaulieu and Lancaster, 2007 | 30. m/0.25 mm/0.25 μm; Program: 50C(1min) => 5C/min => 100C => 10C/min => 250C (9min) |
Capillary | SPB-1 | 800. | Bosch-Fuste, Riu-Aumatell, et al., 2007 | 30. m/0.25 mm/0.25 μm, He; Program: 40C(10min) => 2C/min => 200C(1min) => 2C/min => 250C (10min) |
Capillary | Methyl Silicone | 778. | Chen and Feng, 2007 | Program: not specified |
Capillary | VB-5 | 799. | Karlshøj, Nielsen, et al., 2007 | 60. m/0.25 mm/1. μm, He; Program: 35C(1min) => 4C/min => 175C => 10C/min => 260C |
Capillary | SE-30 | 778. | Liu, Liang, et al., 2007 | Program: not specified |
Capillary | CP-Sil 5 CB | 770. | Bailly, Jerkovic, et al., 2006 | 50. m/0.32 mm/1.20 μm, Helium; Program: 36 0C 20 0C/min -> 85 0C 1 0C/min -> 1345 0C 3 0C/min -> 250 0C |
Capillary | CP Sil 5 CB | 770. | Bailly, Jerkovic, et al., 2006, 2 | 50. m/0.32 mm/1.2 μm, He; Program: 36C => 20C/min => 85C => 1C/min => 145C => 3C/min => 250C |
Capillary | CP-Sil5 CB MS | 774. | Callemien, Dasnoy, et al., 2006 | 50. m/0.32 mm/1.2 μm, N2; Program: 36C => 20C/min => 85C => 1C/min => 145C => 3C/min => 250C(30min) |
Capillary | DB-5 | 803. | Beaulieu, 2005 | 60. m/0.25 mm/0.25 μm; Program: 50C => 5C/min => 100C => 15C/min => 250C (19C) |
Capillary | CP-Sil 5 CB | 774. | Callamien, Dasnoy, et al., 2005 | 50. m/0.32 mm/1.2 μm, Nitrogen; Program: 36 0C 20 0C/min -> 85 0C 1 iC/min -> 145 0C 3 0C/min -> 250 0C |
Capillary | CP-Sil 5 CB | 774. | Callemien, Dasnoy, et al., 2005 | 50. m/0.32 mm/1.20 μm, Nitrogen; Program: 36 0C 20 0C/min -> 85 0C 1 0C/min -> 145 0C 3 0C/min -> 250 0C |
Capillary | HP-5 | 804. | Riu-Aumatell, Lopez-Tamames, et al., 2005 | Program: not specified |
Capillary | HP-5 | 792. | Thierry, Maillard, et al., 2005 | 60. m/0.32 mm/1. μm; Program: not specified |
Capillary | DB-5 | 804. | Tokitomo, Steihaus, et al., 2005 | 30. m/0.32 mm/0.25 μm, Helium; Program: 40 0C (2 min) 40 0C/min -> 60 0C (2 min) 6 0C/min -> 180 0C 10 0C/min -> 240 0C (5 min) |
Capillary | SE-54 | 802. | Buettner, 2004 | 30. m/0.32 mm/0.25 μm, He; Program: 40C(2min) => 40C/min => 50C(2min) => 6C/min => 180C => 15C/min => 230C (10min) |
Capillary | HP-1 | 787. | Carpino, Mallia, et al., 2004 | 12. m/0.32 mm/0.52 μm; Program: 35C(3min) => 6C/min => 190C => 30C/min => 225C |
Capillary | HP-1 | 787. | Carpino, Mallia, et al., 2004, 2 | 25. m/0.2 mm/0.11 μm; Program: 35C(3min) => 4C/min => 190C => 30C/min => 225C(3min) |
Capillary | SPB-5 | 800. | Crook, Boylston, et al., 2004 | 30. m/0.25 mm/0.25 μm, He; Program: 30C(3min) => 5C/min => 80C => 4C/min => 95C => 5C/min => 115C => 10C/min => 200C |
Capillary | MFE-73 | 800. | Escudero, Gogorza, et al., 2004 | Program: not specified |
Capillary | DB-5MS | 798. | Maia, Andrade, et al., 2004 | 30. m/0.25 mm/0.25 μm, He; Program: 40C => 2C/min => 60C => 4C/min => 260C |
Capillary | SE-30 | 784. | Vinogradov, 2004 | Program: not specified |
Capillary | DB-1 | 806. | Alves and Franco, 2003 | 30. m/0.25 mm/0.25 μm, H2; Program: 40C(10min) => 2C/min => 110C => 5C/min => 200C(10min) |
Capillary | HP-5 | 806. | Demyttenaere, Dagher, et al., 2003 | 30. m/0.25 mm/0.25 μm, He; Program: 40C(1min) => 5C/min => 180C => 10C/min => 220C(2min) |
Capillary | HP-5 | 771. | Jordán, Margaría, et al., 2003 | 30. m/0.25 mm/0.25 μm; Program: 40C(6min) => 2.5C/min => 150C => 90C/min => 250C |
Capillary | HP-5 | 789. | Jordán, Margaría, et al., 2003 | 30. m/0.25 mm/0.25 μm; Program: 40C(6min) => 2.5C/min => 150C => 90C/min => 250C |
Capillary | HP-5MS | 802. | Martí, Mestres, et al., 2003 | 30. m/0.25 mm/0.25 μm, He; Program: 40C(5min) => 2C/min => 120C => 10C/min => 210C (30min) |
Capillary | DB-5 | 771. | Qian and Reineccius, 2003 | 30. m/0.32 mm/1. μm; Program: 35C(4min) => 2C/min => 130C => 4C/min => 250C |
Capillary | HP-5MS | 806. | Demyttenaere, Dagher, et al., 2002 | 30. m/0.25 mm/0.25 μm, He; Program: 40C(1min) => 5C/min => 220C => 10C/min => 240C(2min) |
Capillary | MFE-73 | 800. | Ferreira, Ortín, et al., 2002 | H2; Program: not specified |
Capillary | CP-Sil 5 CB | 774. | Gijs, Chevanese, et al., 2002 | 50. m/0.32 mm/1.20 μm, Helium; Program: 36 0C 20 0C/min -> 85 0C 1 0C/min -> 145 0C 3 0C/min -> 250 0C (30 min) |
Capillary | HP-5 | 771. | Jordán, Goodner, et al., 2002 | 30. m/0.25 mm/0.25 μm; Program: not specified |
Capillary | HP-5 | 781. | Jordán, Goodner, et al., 2002 | 30. m/0.25 mm/0.25 μm; Program: not specified |
Capillary | HP-5 | 800. | Jordán, Margaría, et al., 2002 | 30. m/0.25 mm/0.25 μm; Program: 40C (6min) => 2.5C/min => 150C => 90C/min => 250C |
Capillary | HP-5 | 788. | Jordán, Margaría, et al., 2002 | 30. m/0.25 mm/0.25 μm; Program: 40C (6min) => 2.5C/min => 150C => 90C/min => 250C |
Capillary | HP-5MS | 804. | Ansorena, Gimeno, et al., 2001 | 30. m/0.25 mm/0.25 μm, He; Program: 40C (10min) => 3C/min => 120C => 10C/min => 250C (5min) |
Capillary | MFE-73 | 800. | Aznar, López, et al., 2001 | 30. m/0.32 mm/0.1 μm, H2; Program: 40C(5min) => 2C/min => 120C => 10C/min => 210C(30min) |
Capillary | MFE-73 | 800. | Ferreira, Aznar, et al., 2001 | 30. m/0.32 mm/0.1 μm, H2; Program: 40 C (5min) => 2C/min => 120C => 10 C/min => 210 C (30min) |
Capillary | HP-5 | 785. | Jordán, Shaw, et al., 2001 | 30. m/0.25 mm/0.25 μm; Program: 40C (6min) => 2.5C/min => 150C => 90C/min => 250C |
Capillary | CP Sil 5 CB | 774. | Lermusieau, Bulens, et al., 2001 | 50. m/0.32 mm/1.2 μm; Program: 36C => 20C/min => 120C(20min) => 2C/min => 250C(30min) |
Capillary | BPX-5 | 793. | van Ruth, Grossmann, et al., 2001 | 60. m/0.32 mm/1. μm, He; Program: -30C(1min) => 100C/min => 40C(4min) => 2C/min => 90C => 4C/min => 130C => 8C/min => 250C |
Capillary | DB-5 | 796. | Andrade, Maia, et al., 2000 | 30. m/0.25 mm/0.25 μm, He; Program: 40C => 2C/min => 60C => 4C/min => 260C |
Capillary | Methyl Silicone | 784. | Estrada and Gutierrez, 1999 | Program: not specified |
Capillary | DB-1 | 784. | Yen and Lin, 1999 | 60. m/0.32 mm/0.25 μm, N2; Program: 40 0C (10 min) 40 - 80 0C at 2 0C/min 80 - 200 0C at 5 0C/min 200 0C (10 min) |
Capillary | Methyl Silicone | 780. | Zenkevich, 1999 | Program: not specified |
Capillary | SE-54 | 804. | Reiners and Grosch, 1998 | 30. m/0.32 mm/0.25 μm; Program: 35 0C (2 min) 40 0C/min -> 50 0C (1 min) 6 0C/min -> 230 0C |
Capillary | DB-5 | 804. | Guth, 1997 | 30. m/0.32 mm/0.25 μm; Program: 35C (1min) => 40C/min => 60C (1min) => 6C/min => 250C (10min) |
Capillary | SE-54 | 804. | Guth, 1997 | 30. m/0.32 mm/0.25 μm; Program: 35C (1min) => 40C/min => 60C (1min) => 6C/min => 250C (10min) |
Capillary | DB-5 | 801. | Mateo and Zumalacárregui, 1996 | 50. m/0.32 mm/0.25 μm, He; Program: 40C (10min) => 3C/min => 95C => 10C/min => 270C (10min) |
Capillary | DB-5 | 802. | Mateo and Zumalacárregui, 1996 | 50. m/0.32 mm/0.25 μm, He; Program: 40C (10min) => 3C/min => 95C => 10C/min => 270C (10min) |
Capillary | SE-54 | 805. | Schieberle, Ofner, et al., 1990 | 30. m/0.32 mm/0.20 μm; Program: 2 min at 35 0C; 35-50 0C at 40 deg/min; 5 min at 50 0C; 50 - 220 0C at 4 deg/min; |
Capillary | Methyl Silicone | 780. | Zenkevich and Kuznetsova, 1990 | Program: not specified |
Capillary | DB-1 | 789. | Binder and Flath, 1989 | Column length: 60. m; Column diameter: 0.32 mm; Program: not specified |
Capillary | SE-30 | 788. | Ibrahim and Suffet, 1988 | N2; Column length: 60. m; Column diameter: 0.32 mm; Program: 50C(8min) => 3C/min => 150C => 35C/min => 275C (10min) |
Capillary | DB-1 | 780. | Takeoka, Flath, et al., 1988 | 30. m/0.25 mm/0.25 μm, H2; Program: 30C (2min) => 2C/min => 150C => 4C/min => 250C |
Capillary | DB-1 | 783. | Takeoka, Flath, et al., 1988 | 30. m/0.25 mm/0.25 μm, H2; Program: 30C (2min) => 2C/min => 150C => 4C/min => 250C |
Capillary | OV-101 | 784. | Morales and Duque, 1987 | He; Column length: 25. m; Column diameter: 0.31 mm; Program: not specified |
Capillary | OV-101 | 784. | Shibamoto, 1987 | Column length: 50. m; Column diameter: 0.25 mm; Program: not specified |
Capillary | OV-1, SE-30, Methyl silicone, SP-2100, OV-101, DB-1, etc. | 787. | Waggott and Davies, 1984 | Hydrogen; Column length: 50. m; Column diameter: 0.32 mm; Program: not specified |

Normal alkane RI, polar column, isothermal

Column type | Active phase | Temperature (C) | I | Reference | Comment |
---|---|---|---|---|---|
Packed | Carbowax 20M | 100. | 1033. | Yabumoto, Jennings, et al., 1977 |

Normal alkane RI, polar column, temperature ramp

Column type | Active phase | I | Reference | Comment |
---|---|---|---|---|
Capillary | HP-FFAP | 1038. | Wanakhachornkrai and Lertsiri, 9999 | 25. m/0.32 mm/0.50 μm, Helium, 15. K/min; Tstart: 45. C; Tend: 220. C |
Capillary | CP-Wax CB | 1026. | Alves, da Penha, et al., 2012 | 30. m/0.25 mm/0.25 μm, Helium, 2. K/min, 150. C @ 5. min; Tstart: 50. C |
Capillary | Innowax | 1040. | Siristova, Prinosilova, et al., 2012 | 30. m/0.25 mm/0.25 μm, Helium, 40. C @ 1. min, 8. K/min, 250. C @ 2.75 min |
Capillary | VF-Wax MS | 1032. | Duarte, Dias, et al., 2010 | 60. m/0.25 mm/0.25 μm, Helium, 60. C @ 5. min, 3. K/min, 220. C @ 25. min |
Capillary | DB-FFAP | 1028. | Laselan, Buettner, et al., 2009 | 30. m/0.32 mm/0.25 μm, 0. C @ 2. min, 6. K/min; Tend: 200. C |
Capillary | DB-Wax | 1029. | Beck, Higbee, et al., 2008 | 60. m/0.32 mm/0.25 μm, Helium, 30. C @ 4. min, 2. K/min, 200. C @ 30. min |
Capillary | DB-Wax | 1037. | Beck, Higbee, et al., 2008 | 60. m/0.32 mm/0.25 μm, Helium, 30. C @ 4. min, 2. K/min, 200. C @ 30. min |
Capillary | CP-Wax 57 CB | 1014. | Callejon, Morales, et al., 2008 | 50. m/0.25 mm/0.20 μm, Hydrogen, 35. C @ 5. min, 4. K/min, 150. C @ 17.5 min |
Capillary | DB-Wax | 1042. | Caldeira, de Sousa, et al., 2008 | 30. m/0.25 mm/0.25 μm, Helium, 40. C @ 10. min, 3.5 K/min, 180. C @ 30. min |
Capillary | Innowax | 1042. | Kaypak and Avsar, 2008 | 30. m/0.25 mm/0.25 μm, 40. C @ 5. min, 10. K/min, 200. C @ 15. min |
Capillary | DB-Wax | 1036. | Kumazawa, Itobe, et al., 2008 | 30. m/0.25 mm/0.25 μm, He, 5. K/min; Tstart: 30. C; Tend: 210. C |
Capillary | CP-Wax 52CB | 1054. | Audino, Alzogaray, et al., 2007 | He, 50. C @ 2. min, 6. K/min, 220. C @ 20. min; Column length: 30. m; Phase thickness: 0.32 μm |
Capillary | Supelcowax-10 | 1015. | Chin, Nazimah, et al., 2007 | 10. m/0.1 mm/0.1 μm, He, 40. C @ 1.5 min, 50. K/min, 240. C @ 2. min |
Capillary | DB-Wax | 1035. | Dury-Brun, Fournier, et al., 2007 | 30. m/0.32 mm/0.5 μm, He, 5. K/min; Tstart: 40. C; Tend: 240. C |
Capillary | Carbowax 20M | 1046. | Kafkas and Paydas, 2007 | 25. m/0.25 mm/0.40 μm, Helium, 5. K/min, 260. C @ 40. min; Tstart: 60. C |
Capillary | DB-Wax | 1031. | Xu, Fan, et al., 2007 | 30. m/0.25 mm/0.25 μm, He, 40. C @ 2. min, 4. K/min, 230. C @ 5. min |
Capillary | DB-Wax | 1031. | Fan and Qian, 2006 | 30. m/0.32 mm/0.25 μm, He, 40. C @ 2. min, 4. K/min, 230. C @ 15. min |
Capillary | DB-Wax | 1038. | Fan and Qian, 2006, 2 | 30. m/0.32 mm/0.25 μm, N2, 40. C @ 2. min, 6. K/min, 230. C @ 15. min |
Capillary | DB-Wax | 1050. | Kishimoto, Wanikawa, et al., 2006 | 15. m/0.32 mm/0.25 μm, He, 6. K/min, 230. C @ 20. min; Tstart: 40. C |
Capillary | HP-Innowax | 1013. | Komes, Ulrich, et al., 2006 | 30. m/0.25 mm/0.5 μm, He, 40. C @ 3. min, 2. K/min, 200. C @ 15. min |
Capillary | DB-Wax Etr | 1066. | Perestrelo, Fernandes, et al., 2006 | 30. m/0.25 mm/0.25 μm, He, 40. C @ 1. min, 2. K/min, 220. C @ 10. min |
Capillary | DB-Wax | 1030. | Fan and Qian, 2005 | 30. m/0.32 mm/0.25 μm, N2, 40. C @ 2. min, 4. K/min, 230. C @ 5. min |
Capillary | DB-Wax | 1025. | Rizzolo, Cambiaghi, et al., 2005 | 60. m/0.53 mm/1. μm, 50. C @ 10. min, 3. K/min; Tend: 180. C |
Capillary | DB-Wax | 1047. | Culleré, Escudero, et al., 2004 | 30. m/0.32 mm/0.5 μm, H2, 40. C @ 5. min, 4. K/min; Tend: 200. C |
Capillary | PEG-20M | 1035. | Narain, Almeida, et al., 2004 | 50. m/0.20 mm/0.20 μm, 40. C @ 5. min, 3. K/min, 180. C @ 30. min |
Capillary | DB-Wax | 1057. | Alves and Franco, 2003 | 30. m/0.25 mm/0.5 μm, H2, 50. C @ 10. min, 3. K/min, 200. C @ 10. min |
Capillary | DB-Wax | 1028. | Lee and Noble, 2003 | 30. m/0.25 mm/0.25 μm, He, 40. C @ 4. min, 4. K/min, 185. C @ 20. min |
Capillary | DB-Wax | 1044. | López, Ortín, et al., 2003 | 30. m/0.32 mm/0.5 μm, H2, 40. C @ 5. min, 4. K/min; Tend: 200. C |
Capillary | HP-FFAP | 1038. | Wanakhachornkrai and Lertsiri, 2003 | 25. m/0.32 mm/0.5 μm, He, 15. K/min; Tstart: 45. C; Tend: 220. C |
Capillary | DB-Wax | 1032. | Ferreira, Ortín, et al., 2002 | 30. m/0.32 mm/0.5 μm, H2, 40. C @ 5. min, 4. K/min; Tend: 200. C |
Capillary | RTX-Wax | 1050. | Galindo-Cuspinera, Lubran, et al., 2002 | 60. m/0.25 mm/0.5 μm, He, 40. C @ 5. min, 5. K/min, 180. C @ 20. min |
Capillary | DB-Wax | 1036. | Hayata, Sakamoto, et al., 2002 | 60. m/0.25 mm/0.25 μm, He, 40. C @ 10. min, 3. K/min, 220. C @ 10. min |
Capillary | HP-FFAP | 1022. | Qian and Reineccius, 2002 | 25. m/0.32 mm/0.52 μm, 60. C @ 1. min, 5. K/min, 240. C @ 5. min |
Capillary | DB-Wax | 1036. | Aznar, López, et al., 2001 | 30. m/0.32 mm/0.5 μm, H2, 40. C @ 5. min, 4. K/min, 200. C @ 60. min |
Capillary | FFAP | 1040. | Ducruet, Fournier, et al., 2001 | 30. m/0.32 mm/0.25 μm, H2, 40. C @ 5. min, 3. K/min; Tend: 240. C |
Capillary | DB-Wax | 1036. | Ferreira, Aznar, et al., 2001 | 30. m/0.32 mm/0.5 μm, H2, 40. C @ 5. min, 4. K/min, 200. C @ 60. min |
Capillary | DB-FFAP | 1031. | Suriyaphan, Drake, et al., 2001 | 30. m/0.32 mm/0.25 μm, He, 40. C @ 5. min, 5. K/min, 195. C @ 40. min |
Capillary | DB-Wax | 1025. | Wei, Mura, et al., 2001 | 60. m/0.25 mm/0.25 μm, He, 2. K/min; Tstart: 40. C; Tend: 200. C |
Capillary | DB-Wax | 1043. | Franco and Shibamoto, 2000 | He, 50. C @ 8. min, 3. K/min; Column length: 30. m; Column diameter: 0.2 mm; Tend: 180. C |
Capillary | DB-Wax | 1048. | Franco and Shibamoto, 2000 | He, 50. C @ 8. min, 3. K/min; Column length: 30. m; Column diameter: 0.2 mm; Tend: 180. C |
Capillary | Supelcowax-10 | 1030. | Korány, Mednyánszky, et al., 2000 | 60. m/0.25 mm/0.25 μm, He, 4. K/min; Tstart: 60. C; Tend: 280. C |
Capillary | DB-Wax | 1023. | Kotseridis and Baumes, 2000 | 30. m/0.32 mm/0.5 μm, H2, 60. C @ 3. min, 3. K/min, 245. C @ 20. min |
Capillary | DB-Wax | 1025. | Morales, Duque, et al., 2000 | 25. m/0.25 mm/0.25 μm, He, 50. C @ 4. min, 4. K/min, 200. C @ 10. min |
Capillary | DB-Wax | 1031. | Morales, Duque, et al., 2000 | 25. m/0.25 mm/0.25 μm, He, 50. C @ 4. min, 4. K/min, 200. C @ 10. min |
Capillary | DB-Wax | 1035. | Paniandy, Chane-Ming, et al., 2000 | 60. m/0.32 mm/0.25 μm, Helium, 50. C @ 2. min, 5. K/min; Tend: 230. C |
Capillary | DB-Wax | 1043. | Tamura, Boonbumrung, et al., 2000 | Nitrogen, 40. C @ 10. min, 2. K/min; Column length: 60. m; Column diameter: 0.25 mm; Tend: 200. C |
Capillary | DB-Wax | 1033. | Umano, Hagi, et al., 2000 | 60. m/0.25 mm/0.25 μm, He, 40. C @ 2. min, 2. K/min; Tend: 200. C |
Capillary | CP-Wax 52CB | 1025. | Hwan and Chou, 1999 | 50. m/0.32 mm/0.22 μm, H2, 60. C @ 4. min, 2. K/min, 190. C @ 21. min |
Capillary | Carbowax 20M | 1043. | Lopez, Ferreira, et al., 1999 | 60. m/0.32 mm/0.5 μm, He, 40. C @ 5. min, 2. K/min; Tend: 190. C |
Capillary | DB-Wax | 1033. | Umano, Nakahara, et al., 1999 | 60. m/0.25 mm/0.25 μm, He, 40. C @ 2. min, 2. K/min; Tend: 200. C |
Capillary | Supelcowax-10 | 1052. | Campeanu, Burcea, et al., 1998 | 60. m/0.32 mm/0.5 μm, H2, 35. C @ 5. min, 5. K/min, 250. C @ 20. min |
Capillary | Carbowax 20M | 1043. | Ferreira, Ardanuy, et al., 1998 | 60. m/0.32 mm/0.5 μm, He, 40. C @ 5. min, 2. K/min; Tend: 190. C |
Capillary | Carbowax 20M | 1043. | Ferreira, Lopez, et al., 1998 | 60. m/0.32 mm/0.5 μm, He, 40. C @ 5. min, 2. K/min; Tend: 190. C |
Capillary | HP-Innowax | 1029. | Ong, Acree, et al., 1998 | 4. K/min; Column length: 25. m; Column diameter: 0.32 mm; Tstart: 35. C; Tend: 250. C |
Capillary | DB-Wax | 1009. | Wada and Shibamoto, 1997 | He, 3. K/min, 200. C @ 40. min; Column length: 60. m; Column diameter: 0.25 mm; Tstart: 50. C |
Capillary | DB-Wax | 1025. | Morales, Albarracín, et al., 1996 | 30. m/0.25 mm/0.25 μm, He, 20. C @ 4. min, 4. K/min, 200. C @ 10. min |
Capillary | DB-Wax | 1010. | Morales, Albarracín, et al., 1996 | 30. m/0.25 mm/0.25 μm, He, 50. C @ 4. min, 4. K/min, 200. C @ 10. min |
Capillary | DB-Wax | 1018. | Christensen and Reineccius, 1995 | 30. m/0.25 mm/0.25 μm, 20. C @ 1. min, 5. K/min; Tend: 230. C |
Capillary | Carbowax 20M | 1025. | Egolf and Jurs, 1993 | 2. K/min; Column length: 80. m; Column diameter: 0.2 mm; Tstart: 70. C; Tend: 170. C |
Capillary | CP-Wax 52CB | 1030.9 | Chyau, Chen, et al., 1992 | 50. m/0.32 mm/0.22 μm, H2, 50. C @ 5. min, 2. K/min; Tend: 200. C |
Capillary | Carbowax 20M | 1025. | Anker, Jurs, et al., 1990 | 2. K/min; Column length: 80. m; Column diameter: 0.2 mm; Tstart: 70. C; Tend: 170. C |
Capillary | SP-1000 | 1060. | De Llano D.G., Ramos M., et al., 1990 | 25. m/0.2 mm/0.43 μm, N2, 4. K/min, 190. C @ 30. min; Tstart: 60. C |
Capillary | DB-Wax | 1028. | Binder and Flath, 1989 | 50. C @ 0.1 min, 4. K/min, 250. C @ 5. min; Column length: 60. m; Column diameter: 0.32 mm |
Capillary | DB-Wax | 1035. | Takeoka and Butter, 1989 | 60. m/0.32 mm/0.25 μm, He, 30. C @ 4. min, 2. K/min; Tend: 180. C |
Capillary | DB-Wax | 1035. | Takeoka and Butter, 1989 | 60. m/0.32 mm/0.25 μm, He, 30. C @ 4. min, 2. K/min; Tend: 180. C |
Capillary | Carbowax 20M | 1035. | Mihara, Tateba, et al., 1988 | N2, 3. K/min; Column length: 50. m; Column diameter: 0.22 mm; Tstart: 80. C; Tend: 200. C |
Capillary | Carbowax 20M | 1037. | Mihara, Tateba, et al., 1988 | N2, 3. K/min; Column length: 50. m; Column diameter: 0.22 mm; Tstart: 80. C; Tend: 200. C |
Capillary | Carbowax 20M | 1035. | Mihara, Tateba, et al., 1988 | N2, 3. K/min; Column length: 50. m; Column diameter: 0.22 mm; Tstart: 80. C; Tend: 200. C |
Capillary | Carbowax 20M | 1037. | Mihara, Tateba, et al., 1988 | N2, 3. K/min; Column length: 50. m; Column diameter: 0.22 mm; Tstart: 80. C; Tend: 200. C |
Capillary | Carbowax 20M | 1035. | Mihara, Tateba, et al., 1987 | N2, 3. K/min; Column length: 50. m; Column diameter: 0.22 mm; Tstart: 80. C; Tend: 200. C |
Capillary | Carbowax 20M | 1037. | Mihara, Tateba, et al., 1987 | N2, 3. K/min; Column length: 50. m; Column diameter: 0.22 mm; Tstart: 80. C; Tend: 200. C |
Capillary | Carbowax 20M | 1035. | Mihara, Tateba, et al., 1987 | N2, 3. K/min; Column length: 50. m; Column diameter: 0.22 mm; Tstart: 80. C; Tend: 200. C |
Capillary | Carbowax 20M | 1037. | Mihara, Tateba, et al., 1987 | N2, 3. K/min; Column length: 50. m; Column diameter: 0.22 mm; Tstart: 80. C; Tend: 200. C |
Capillary | Carbowax 20M | 1028. | Engel and Tressl, 1983 | 2. K/min; Column length: 50. m; Column diameter: 0.32 mm; Tstart: 70. C; Tend: 180. C |

Normal alkane RI, polar column, custom temperature program

Column type | Active phase | I | Reference | Comment |
---|---|---|---|---|
Capillary | EC-1000 | 1030. | Delabre and Bendall, 9999 | Program: not specified |
Capillary | Carbowax 20M | 1039. | Lee, Chong, et al., 2012 | Program: not specified |
Capillary | Innowax | 1036. | Siristova, Prinosilova, et al., 2012 | 30. m/0.25 mm/0.25 μm, Helium; Program: not specified |
Capillary | DB-Wax | 1075. | Miyazaki, Plotto, et al., 2011 | 60. m/0.25 mm/0.50 μm, Helium; Program: 40 0C 4 0C/min -> 230 0C 100 0C/min -> 260 0C (11.7 min) |
Capillary | CP-Wax 52 CB | 1060. | Povolo, Cabassi, et al., 2011 | Program: not specified |
Capillary | DB-Wax | 1032. | Sampaio, Garruti, et al., 2011 | 30. m/0.25 mm/0.25 μm, Hydrogen; Program: 35 0C (9 min) 5 0C/min -> 80 0C 1 0C/min -> 100 0C 16 0C/min -> 210 0C (20 min) |
Capillary | HP-Innowax | 1039. | Xiao, Dai, et al., 2011 | 60. m/0.25 mm/0.25 μm, Helium; Program: 40 0C (2 min) 3 0C/min -> 150 0C 5 0C/min -> 220 0C (5 min) |
Capillary | DB-Wax | 1033. | San-Juan, Petka, et al., 2010 | 30. m/0.32 mm/0.50 μm, Hydrogen; Program: 40 0C (5 min) 4 0C/min -> 100 0C 6 0C/min -> 220 0C (20 min) |
Capillary | DB-Wax | 1033. | Ferreira, Juan, et al., 2009 | 30. m/0.32 mm/0.50 μm; Program: 40 0C (5 min) 4 0C/min -> 100 0C 6 0C/min -> 220 0C (40 min) |
Capillary | FFAP | 1002. | Ortiz, Echeverra, et al., 2009 | 50. m/0.20 mm/0.33 μm, Helium; Program: 70 0C (1 min) 3 0C/min -> 142 0C 5 0C/min -> 225 0C (10 min) |
Capillary | DB-Wax | 1023. | Rowan, Hunt, et al., 2009 | 20. m/0.18 mm/0.18 μm, Helium; Program: 35 0C (1 min) 2.9 0C/min -> 100 0C 8 0C/min -> 200 0C (5 min) |
Capillary | DB-Wax | 1023. | Rowan, Hunt, et al., 2009, 2 | 20. m/0.18 mm/0.18 μm, Helium; Program: 35 0C (1 min) 2/9 0C/min -> 100 0C 8 0C/min -> 200 0C (5 min) |
Capillary | DB-Wax | 1050. | Valappil, Fan, et al., 2009 | 30. m/0.32 mm/0.50 μm, Helium; Program: 40 0C 7 0C/min -> 110 0C 15 0C/min -> 250 0C (3 min) |
Capillary | DB-Wax | 1026. | Li, Tao, et al., 2008 | 30. m/0.32 mm/0.25 μm, Helium; Program: 40 0C (3 min) 4 0C/min -> 160 0C 7 0C/min -> 220 0C (8 min) |
Capillary | BP-20 | 1076. | Rodrigues, Caldera, et al., 2008 | 30. m/0.25 mm/0.25 μm, Helium; Program: 40 0C (1 min) 2 0C/min -> 100 0C (2 min) 1.7 0C/min -> 180 0C (1 min) 25 0C/min -> 220 0C (10 min) |
Capillary | BP-20 | 1078. | Rodrigues, Caldera, et al., 2008 | 30. m/0.25 mm/0.25 μm, Helium; Program: 40 0C (1 min) 2 0C/min -> 100 0C (2 min) 1.7 0C/min -> 180 0C (1 min) 25 0C/min -> 220 0C (10 min) |
Capillary | BP-20 | 1079. | Rodrigues, Caldera, et al., 2008 | 30. m/0.25 mm/0.25 μm, Helium; Program: 40 0C (1 min) 2 0C/min -> 100 0C (2 min) 1.7 0C/min -> 180 0C (1 min) 25 0C/min -> 220 0C (10 min) |
Capillary | DB-Wax | 1035. | Tao, Wenlai, et al., 2008 | 30. m/0.32 mm/0.25 μm, Helium; Program: 50 0C 20 0C/min -> 80 0C 3 0C/min -> 230 0C |
Capillary | Supelcowax-10 | 1040. | Berard, Bianchi, et al., 2007 | 30. m/0.25 mm/0.25 μm, He; Program: 35C(8min) => 6C/min => 60C => 4C/min => 160C => 20C/min => 200C(1min) |
Capillary | Supelcowax-10 | 1046. | Berard, Bianchi, et al., 2007 | 30. m/0.25 mm/0.25 μm, He; Program: 35C(8min) => 6C/min => 60C => 4C/min => 160C => 20C/min => 200C(1min) |
Capillary | Supelcowax-10 | 1031. | Bosch-Fuste, Riu-Aumatell, et al., 2007 | 30. m/0.25 mm/0.25 μm, He; Program: 40C(10min) => 2C/min => 200C(1min) => 2C/min => 250C (10min) |
Capillary | Carbowax 20M | 1022. | Dury-Brun, Fournier, et al., 2007 | Program: not specified |
Capillary | FFAP | 1043. | Lara, Echeverría, et al., 2007 | 50. m/0.2 mm/0.33 μm, He; Program: 70C(1min) => 3C/min => 142C => 5C/min => 225C (10min) |
Capillary | DB-Wax | 1026. | Li, Tao, et al., 2007 | 30. m/0.32 mm/0.25 μm, He; Program: 40C(3min) => 4C/min => 160C => 7C/min => 230C (8min) |
Capillary | FFAP | 1043. | Lopez, Villatoro, et al., 2007 | 50. m/0.2 mm/0.33 μm, He; Program: 70C(1min) => 3C/min => 142C => 5C/min => 225C(10min) |
Capillary | HP-Innowax | 1029. | Narain, Galvao, et al., 2007 | 30. m/0.25 mm/0.25 μm, Helium; Program: 30 0C (5 min) 5 0C/min -> 100 0C (5 min) 1 0C/min -> 130 0C 10 0C/min -> 195 0C (45 min) |
Capillary | HP-Innowax | 1022. | Narain, Galvao, et al., 2007, 2 | 30. m/0.25 mm/0.25 μm, He; Program: 30C(5min) => 7C/min => 100C(5min) => 1C/min => 130C => 10C/min => 195C(45min) |
Capillary | HP-Innowax | 1037. | Narain, Galvao, et al., 2007, 2 | 30. m/0.25 mm/0.25 μm, He; Program: 30C(5min) => 7C/min => 100C(5min) => 1C/min => 130C => 10C/min => 195C(45min) |
Capillary | HP-Innowax | 1037. | Narain, Galvao, et al., 2007, 2 | 30. m/0.25 mm/0.25 μm, He; Program: 30C(5min) => 7C/min => 100C(5min) => 1C/min => 130C => 10C/min => 195C(45min) |
Capillary | DB-Wax | 1044. | Selli, 2007 | 30. m/0.32 mm/0.50 μm, Hydrogen; Program: 60 0C (3 min) 2 0C/min -> 220 0C 3 0C/min -> 245 0C (20 min) |
Capillary | DB-Wax | 1028. | Tian, Zhang, et al., 2007 | 30. m/0.25 mm/0.25 μm, He; Program: 50 0C (2 min) 6 0C/min -> 150 0C 8 0C/min -> 230 0C (15 min) |
Capillary | HP-Innowax | 990. | Weldegergis B.T., Tredoux A.G.J., et al., 2007 | 30. m/0.25 mm/0.5 μm, He; Program: 30C(2min) => 4C/min => 130C => 8C/min => 250C(5min) |
Capillary | FFAP-CB | 1081. | Bailly, Jerkovic, et al., 2006 | 25. m/0.32 mm/0.30 μm, Helium; Program: 36 0C 20 0C/min -> 85 0C 1 0C/min -> 1345 0C 3 0C/min -> 250 0C |
Capillary | FFAP | 1043. | Lara, Graell, et al., 2006 | 50. m/0.2 mm/0.33 μm, He; Program: 70C(1min) => 3C/min => 142C => 5C/min => 225C(10min) |
Capillary | HP-Innowax | 1030. | Quijano and Pino, 2006 | 60. m/0.25 mm/0.25 μm, Nitrogen; Program: 50 0C (4 min) -> 40 0C 4 0C/min -> 220 0C |
Capillary | DB-Wax | 1040. | Berlinet, Ducruet, et al., 2005 | 30. m/0.25 mm/0.25 μm, He; Program: not specified |
Capillary | DB-FFAP | 1028. | Buettner and Mestres, 2005 | 30. m/0.32 mm/0.25 μm; Program: 35C(2min) => 40C/min => 60C(2min) => 6C/min => 180C => 10C/min=230C(10min) |
Capillary | CP-Wax 52CB | 1045. | Jales, Maia, et al., 2005 | Hydrogen; Program: not specified |
Capillary | DB-Wax | 1037. | Mattheis, Fan, et al., 2005 | 60. m/0.25 mm/0.25 μm, He; Program: 35C(5min) => 2C/min => 50C => 5C/min => 200C (5min) |
Capillary | CP-Wax 58CB | 1042. | Tokitomo, Steihaus, et al., 2005 | 25. m/0.32 mm/0.20 μm, Helium; Program: 40 0C (2 min) 40 0C/min -> 60 0C (1 min) 6 0C/min -> 180 0C 10 0C/min -> 240 0C (5 min) |
Capillary | DB-FFAP | 1028. | Buettner, 2004 | 30. m/0.32 mm/0.25 μm, He; Program: 40C(2min) => 40C/min => 60C(2min) => 6C/min => 180C => 15C/min => 230C (10min) |
Capillary | FFAP | 1043. | Echeverría, Correa, et al., 2004 | 50. m/0.2 mm/0.33 μm, He; Program: 70C(1min) => 3C/min => 142C => 5C/min => 225C(10min) |
Capillary | DB-Wax | 1032. | Escudero, Gogorza, et al., 2004 | Program: not specified |
Capillary | Innowax | 1046. | Selli, Kürkçüoglu, et al., 2004 | 60. m/0.25 mm/0.25 μm, He; Program: 50C(10min) => 4C/min => 220C(10min) => 1C/min => 240C |
Capillary | Carbowax 20M | 1024. | Vinogradov, 2004 | Program: not specified |
Capillary | HP-FFAP | 1043. | Echeverria, Fuentes, et al., 2003 | 50. m/0.2 mm/0.33 μm, He; Program: 70C(1min) => 3C/min => 142C => 5C/min => 225C (10min) |
Capillary | PEG-20M | 1042. | Garruti, Franco, et al., 2003 | 30. m/0.25 mm/0.25 μm; Program: 50C(8min) => 4C/min => 110C => 16C/min => 200C |
Capillary | CP-WAX 57CB | 1033. | Martí, Mestres, et al., 2003 | 50. m/0.25 mm/0.2 μm, He; Program: 40C(10min) => 5C/min => 100C => 3C/min => 180C => 20C/min => 210C (10min) |
Capillary | DB-Wax | 1022. | Qian and Reineccius, 2003 | 60. m/0.32 mm/0.5 μm, He; Program: 35C(4min) => 2C/min => 130C => 4C/min => 250C |
Capillary | Supelcowax-10 | 1071. | Rogerson and de Freitas, 2002 | 60. m/0.25 mm/0.25 μm, He; Program: 40C(20min) => (1.5C/min) => 200C => (10C/min) => 250C(120min) |
Capillary | TRWAX | 1056. | Torrens, 2002 | 60. m/0.25 mm/0.25 μm, He; Program: not specified |
Capillary | FFAP | 1028. | Buettner and Schieberle, 2001 | 30. m/0.32 mm/0.25 μm, He; Program: 35C (2min) => 40C/min => 60C (2min) => 6C/min => 180C => 10C/min => 230C (10min) |
Capillary | DB-Wax | 1025. | Miranda, Nogueira, et al., 2001 | 30. m/0.25 mm/0.25 μm, He; Program: 25 0C (0.5 min) 50 K/min -> 50 0C 3.5 K/min -> 150 0C 7.5 K/min -> 240 0C |
Capillary | FFAP | 1047. | Lopez, Lavilla, et al., 2000 | 50. m/0.2 mm/0.33 μm, N2; Program: 70C(1min) => 3C/min => 142C(2min) => 25C/min => 230C(5min) |
Capillary | DB-Wax | 1025. | Paniandy, Chane-Ming, et al., 2000 | 60. m/0.32 mm/0.25 μm, Helium; Program: not specified |
Capillary | FFAP | 1031. | Lambert, Demazeau, et al., 1999 | 30. m/0.32 mm/0.25 μm; Program: not specified |
Capillary | Cross-linked FFAP | 1047. | Lavilla, Puy, et al., 1999 | 50. m/0.2 mm/0.33 μm, N2; Program: 70C(1min) => 3C/min => 142C (2min) => 25C/min => 230C(5min) |
Capillary | FFAP | 1047. | López, Lavilla, et al., 1998 | 50. m/0.2 mm/0.33 μm, N2; Program: 70C (1min) => 3C/min => 142C (2min) => 25C/min => 230C (5min) |
Capillary | FFAP | 1023. | Reiners and Grosch, 1998 | 25. m/0.32 mm/0.3 μm; Program: 35C (2min) => 40C/min => 60C(1min) => 6C/min => 230C |
Capillary | PEG | 1044. | Vas, Gal, et al., 1998 | 40. m/0.182 mm/0.30 μm, Hydrogen; Program: 35 0C (5 min) 5 0C/min -> 100 0C 3 0C/min -> 200 0C (1 min) 20 0C/min -> 240 0C (2 min) |
Capillary | DB-FFAP | 1023. | Guth, 1997 | 30. m/0.32 mm/0.25 μm; Program: 35C (1min) => 40C/min => 60C (1min) => 6C/min => 250C (10min) |
Capillary | DB-FFAP | 1023. | Guth, 1997 | 30. m/0.32 mm/0.25 μm; Program: 35C (1min) => 40C/min => 60C (1min) => 6C/min => 250C (10min) |
Capillary | DB-Wax | 1046. | Peng, Yang, et al., 1991 | Program: not specified |
Capillary | DB-Wax | 1028. | Binder and Flath, 1989 | Column length: 60. m; Column diameter: 0.32 mm; Program: not specified |
Capillary | Carbowax 20M | 1025. | Shibamoto, 1987 | Column length: 50. m; Column diameter: 0.25 mm; Program: not specified |

References

Wiberg and Waldron, 1991
Wiberg, K.B.; Waldron, R.F.,
Lactones. 2. Enthalpies of hydrolysis, reduction, and formation of the C4-C13 monocyclic lactones. strain energies and conformations,
J. Am. Chem. Soc., 1991, 113, 7697-7705. [all data]
Handrick, 1956
Handrick, G.R.,
Report of the study of pure explosive compounds. Part IV. Calculation of heat of combustion of organic compounds from structural features and calculation of power of high explosives, Rpt. C-58247 for the Office of the Chief of Ordnance, contract DA-19-020-ORD-47 by the Arthur D. Little, Inc., Cambridge, MA, 1956, 467-573. [all data]
Schjanberg, 1935
Schjanberg, E.,
Die Verbrennungswarmen und die Refraktionsdaten einiger chlorsubstituierter Fettsauren und Ester.,
Z. Phys. Chem. Abt. A, 1935, 172, 197-233. [all data]
Fuchs, 1979
Fuchs, R.,
Heat capacities of some liquid aliphatic, alicyclic, and aromatic esters at 298.15 K,
J. Chem. Thermodyn., 1979, 11, 959-961. [all data]
Kurnakov and Voskresenskaya, 1936
Kurnakov, N.S.; Voskresenskaya, N.K.,
Calorimetry of liquid binary systems, Izv. Akad. Nauk SSSR,
Otdel. Mat. i Estestv. Nauk. Ser. Khim, 1936, 1936, 439-461. [all data]
Kolosovskii and Udovenko, 1934
Kolosovskii, N.A.; Udovenko, W.W.,
Specific heat of liquids. II.,
Zhur. Obshchei Khim., 1934, 4, 1027-1033. [all data]
de Kolossowsky and Udowenko, 1933
de Kolossowsky, N.A.; Udowenko, W.W.,
Mesure des chaleurs specifique moleculaires de quelques liquides,
Compt. rend., 1933, 197, 519-520. [all data]
Timmermans, 1922
Timmermans, J.,
Investigation of the Freezing Point of Organic Substances VII,
Bull. Soc. Chim. Belg., 1922, 31, 389. [all data]
Timmermans and Mattaar, 1921
Timmermans, J.; Mattaar, J.F.,
Freezing points of orgainic substances VI. New experimental determinations.,
Bull. Soc. Chim. Belg., 1921, 30, 213. [all data]
Young, 1994
Young, C.L.,
Personal Commun. 1994 1994, 1994. [all data]
De Heen, 1888
De Heen, P.,
Research on Physics and Theory of Liquids, Experimental Part Paris, 1888. [all data]
Nadezhdin, 1887
Nadezhdin, A.,
Rep. Phys., 1887, 23, 708. [all data]
Pawlewski, 1882
Pawlewski, B.,
The critical temperatures of ester compounds,
Ber. Dtsch. Chem. Ges., 1882, 15, 2460-4. [all data]
Hernández and Ortega, 1997
Hernández, Pablo; Ortega, Juan,
Vapor-Liquid Equilibria and Densities for Ethyl Esters (Ethanoate to Butanoate) and Alkan-2-ol (C 3 -C 4 ) at 101.32 kPa,
J. Chem. Eng. Data, 1997, 42, 6, 1090-1100, https://doi.org/10.1021/je970077b
. [all data]
Fárková and Wichterle, 1993
Fárková, J.; Wichterle, I.,
Vapour pressures of some ethyl and propyl esters of fatty acids,
Fluid Phase Equilibria, 1993, 90, 1, 143-148, https://doi.org/10.1016/0378-3812(93)85009-B
. [all data]
Stephenson and Malanowski, 1987
Stephenson, Richard M.; Malanowski, Stanislaw,
Handbook of the Thermodynamics of Organic Compounds, 1987, https://doi.org/10.1007/978-94-009-3173-2
. [all data]
Majer and Svoboda, 1985
Majer, V.; Svoboda, V.,
Enthalpies of Vaporization of Organic Compounds: A Critical Review and Data Compilation, Blackwell Scientific Publications, Oxford, 1985, 300. [all data]
Stull, 1947
Stull, Daniel R.,
Vapor Pressure of Pure Substances. Organic and Inorganic Compounds,
Ind. Eng. Chem., 1947, 39, 4, 517-540, https://doi.org/10.1021/ie50448a022
. [all data]
Holmes and Lossing, 1980
Holmes, J.L.; Lossing, F.P.,
Gas-phase heats of formation of keto and enol ions of carbonyl compounds.,
J. Am. Chem. Soc., 1980, 102, 1591. [all data]