barium bromide
- Formula: BaBr2
- Molecular weight: 297.135
- CAS Registry Number: 10553-31-8

Condensed phase thermochemistry data

Quantity | Value | Units | Method | Reference | Comment |
---|---|---|---|---|---|
ΔfH°liquid | -730.19 | kJ/mol | Review | Chase, 1998 | Data last reviewed in December, 1974 |
Quantity | Value | Units | Method | Reference | Comment |
S°liquid,1 bar | 172.11 | J/mol*K | Review | Chase, 1998 | Data last reviewed in December, 1974 |
Quantity | Value | Units | Method | Reference | Comment |
ΔfH°solid | -757.72 | kJ/mol | Review | Chase, 1998 | Data last reviewed in December, 1974 |
Quantity | Value | Units | Method | Reference | Comment |
S°solid | 148.53 | J/mol*K | Review | Chase, 1998 | Data last reviewed in December, 1974 |
Liquid Phase Heat Capacity (Shomate Equation)
Cp° = A + B*t + C*t2 + D*t3 +
E/t2
H° − H°298.15= A*t + B*t2/2 +
C*t3/3 + D*t4/4 − E/t + F − H
S° = A*ln(t) + B*t + C*t2/2 + D*t3/3 −
E/(2*t2) + G
Cp = heat capacity (J/mol*K)
H° = standard enthalpy (kJ/mol)
S° = standard entropy (J/mol*K)
t = temperature (K) / 1000.
View plot Requires a JavaScript / HTML 5 canvas capable browser.
Temperature (K) | 1130. to 3000. |
---|---|
A | 104.8510 |
B | 7.559149×10-9 |
C | -3.399488×10-9 |
D | 5.099125×10-10 |
E | 1.145659×10-9 |
F | -772.7011 |
G | 276.0068 |
H | -730.1917 |
Reference | Chase, 1998 |
Comment | Data last reviewed in December, 1974 |
Solid Phase Heat Capacity (Shomate Equation)
Cp° = A + B*t + C*t2 + D*t3 +
E/t2
H° − H°298.15= A*t + B*t2/2 +
C*t3/3 + D*t4/4 − E/t + F − H
S° = A*ln(t) + B*t + C*t2/2 + D*t3/3 −
E/(2*t2) + G
Cp = heat capacity (J/mol*K)
H° = standard enthalpy (kJ/mol)
S° = standard entropy (J/mol*K)
t = temperature (K) / 1000.
View plot Requires a JavaScript / HTML 5 canvas capable browser.
Temperature (K) | 298. to 1130. |
---|---|
A | 70.56860 |
B | 21.62065 |
C | -0.001626 |
D | 0.001652 |
E | -0.000068 |
F | -779.7261 |
G | 227.4849 |
H | -757.7224 |
Reference | Chase, 1998 |
Comment | Data last reviewed in December, 1974 |

Gas phase ion energetics data

Data compiled as indicated in comments:
LBLHLM - Sharon G. Lias, John E. Bartmess, Joel F. Liebman, John L. Holmes, Rhoda D. Levin, and W. Gary Mallard
LLK - Sharon G. Lias, Rhoda D. Levin, and Sherif A. Kafafi
Ionization energy determinations
IE (eV) | Method | Reference | Comment |
---|---|---|---|
9.2 | S | Emons, Kiessling, et al., 1982 | LBLHLM |
8.5 | PE | Lee and Potts, 1979 | LLK |
≤8.63 | PE | Lee and Potts, 1979, 2 | LLK |
9.0 | PE | Lee and Potts, 1979 | Vertical value; LLK |
9.40 ± 0.02 | PE | Lee and Potts, 1979, 2 | Vertical value; LLK |
Appearance energy determinations
Ion | AE (eV) | Other Products | Method | Reference | Comment |
---|---|---|---|---|---|
Ba+ | 13.95 | Br2 | S | Emons, Kiessling, et al., 1982 | LBLHLM |
BaBr+ | 9.6 | Br | S | Emons, Kiessling, et al., 1982 | LBLHLM |

Gas phase thermochemistry data

Quantity | Value | Units | Method | Reference | Comment |
---|---|---|---|---|---|
ΔfH°gas | -101.50 | kcal/mol | Review | Chase, 1998 | Data last reviewed in December, 1974 |
Quantity | Value | Units | Method | Reference | Comment |
S°gas,1 bar | 81.757 | cal/mol*K | Review | Chase, 1998 | Data last reviewed in December, 1974 |
Gas Phase Heat Capacity (Shomate Equation)
Cp° = A + B*t + C*t2 + D*t3 +
E/t2
H° − H°298.15= A*t + B*t2/2 +
C*t3/3 + D*t4/4 − E/t + F − H
S° = A*ln(t) + B*t + C*t2/2 + D*t3/3 −
E/(2*t2) + G
Cp = heat capacity (cal/mol*K)
H° = standard enthalpy (kcal/mol)
S° = standard entropy (cal/mol*K)
t = temperature (K) / 1000.
View plot Requires a JavaScript / HTML 5 canvas capable browser.
Temperature (K) | 3000. to 6000. |
---|---|
A | 13.90483 |
B | 0.004832 |
C | -0.001334 |
D | 0.000115 |
E | -0.024623 |
F | -105.7285 |
G | 98.44312 |
H | -101.5000 |
Reference | Chase, 1998 |
Comment | Data last reviewed in December, 1974 |

References

Chase, 1998
Chase, M.W., Jr.,
NIST-JANAF Themochemical Tables, Fourth Edition,
J. Phys. Chem. Ref. Data, Monograph 9, 1998, 1-1951. [all data]
Emons, Kiessling, et al., 1982
Emons, H.-H.; Kiessling, D.; Horlbeck, W.,
Dampfdruckmessungen und massenspektrometrische untersuchungen der gasphase uber erdalkalimetallhalogeniden,
Z. Anorg. Allg. Chem., 1982, 488, 219. [all data]
Lee and Potts, 1979
Lee, E.P.F.; Potts, A.W.,
The HeII α Photoelectron Spectra of the Barium Halides,
Chem. Phys. Lett., 1979, 63, 61. [all data]
Lee and Potts, 1979, 2
Lee, E.P.F.; Potts, A.W.,
An investigation of the valence shell electronic structure of alkaline earth halides by using Ab initio S. C. F. calculations and photoelectron spectroscopy,
Proc. R. Soc. London A:, 1979, 365, 395. [all data]