Azulene, 1,2,3-triphenyl-
- Formula: C28H20
- Molecular weight: 356.4584
- IUPAC Standard InChIKey: BBAHZGDEGNYDBK-UHFFFAOYSA-N
- CAS Registry Number: 1055-26-1
- Chemical structure:
View 3d structure (requires JavaScript / HTML 5) - Other names: 1,2,3-Triphenylazulene

Gas phase ion energetics data

Data compiled by: Sharon G. Lias, Rhoda D. Levin, and Sherif A. Kafafi
Ionization energy determinations
IE (eV) | Method | Reference | Comment |
---|---|---|---|
6.9 | PE | Dougherty, Lewis, et al., 1980 | Vertical value |

References

Dougherty, Lewis, et al., 1980
Dougherty, D.; Lewis, J.; Nauman, R.V.; McGlynn, S.P.,
Photoelectron spectroscopy of azulenes,
J. Electron Spectrosc. Relat. Phenom., 1980, 19, 21. [all data]