Methyl acetoacetate
- Formula: C5H8O3
- Molecular weight: 116.1152
- IUPAC Standard InChIKey: WRQNANDWMGAFTP-UHFFFAOYSA-N
- CAS Registry Number: 105-45-3
- Chemical structure:
View 3d structure (requires JavaScript / HTML 5) - Other names: Butanoic acid, 3-oxo-, methyl ester; Acetoacetic acid, methyl ester; Methyl acetylacetate; Methyl 3-oxobutyrate; Acetoacetic methyl ester; Methyl acetylacetonate; Methylester kyseliny acetoctove; 3-Oxobutanoic acid methyl ester; Methyl 3-oxobutanoate

Condensed phase thermochemistry data

Data compiled by: Hussein Y. Afeefy, Joel F. Liebman, and Stephen E. Stein
Quantity | Value | Units | Method | Reference | Comment |
---|---|---|---|---|---|
ΔfH°liquid | -623.21 | kJ/mol | Ccb | Guinchant, 1918 | Author hf288_condensed[kcal/mol]=-153.5 kcal/mol |
Quantity | Value | Units | Method | Reference | Comment |
ΔcH°liquid | -2487.7 | kJ/mol | Ccb | Guinchant, 1918 | Author hf288_condensed[kcal/mol]=-153.5 kcal/mol; Corresponding ΔfHºliquid = -623.21 kJ/mol (simple calculation by NIST; no Washburn corrections) |

Phase change data

Data compiled as indicated in comments:
BS - Robert L. Brown and Stephen E. Stein
TRC - Thermodynamics Research Center, NIST Boulder Laboratories, Chris Muzny director
AC - William E. Acree, Jr., James S. Chickos
Quantity | Value | Units | Method | Reference | Comment |
---|---|---|---|---|---|
Tboil | 444. ± 2. | K | AVG | N/A | Average of 6 values; Individual data points |
Enthalpy of vaporization
ΔvapH (kJ/mol) | Temperature (K) | Method | Reference | Comment |
---|---|---|---|---|
45.4 | 304. | A | Stephenson and Malanowski, 1987 | Based on data from 289. to 446. K.; AC |

Reaction thermochemistry data

Data compiled by: Hussein Y. Afeefy, Joel F. Liebman, and Stephen E. Stein
Individual Reactions
By formula: C5H8O3 = C5H8O3
Quantity | Value | Units | Method | Reference | Comment |
---|---|---|---|---|---|
ΔrH° | -12.7 ± 2.5 | kJ/mol | Eqk | Folkendt, Weiss-Lopez, et al., 1985 | gas phase; Gas phase NMR |

Gas phase ion energetics data

Data compiled by: Sharon G. Lias and Joel F. Liebman
Ionization energy determinations
IE (eV) | Method | Reference |
---|---|---|
9.815 | EI | Martigny, 1990 |
Appearance energy determinations
Ion | AE (eV) | Other Products | Method | Reference | Comment |
---|---|---|---|---|---|
C3H5O2+ | 10.30 | C2H3O | EI | Holmes, Lossing, et al., 1991 |

Normal alkane RI, polar column, temperature ramp

Column type | Active phase | I | Reference | Comment |
---|---|---|---|---|
Capillary | ZB-Wax | 1396. | N/A | 30. m/0.32 mm/0.25 μm, Helium, 40. C @ 2. min, 5. K/min, 250. C @ 5. min |

References

Guinchant, 1918
Guinchant, M.J.,
Etude sur la fonction acide dans les derives metheniques et methiniques,
Ann. Chem., 1918, 10, 30-84. [all data]
Stephenson and Malanowski, 1987
Stephenson, Richard M.; Malanowski, Stanislaw,
Handbook of the Thermodynamics of Organic Compounds, 1987, https://doi.org/10.1007/978-94-009-3173-2
. [all data]
Folkendt, Weiss-Lopez, et al., 1985
Folkendt, M.M.; Weiss-Lopez, B.E.; Chauvel, J.P., Jr.; True, N.S.,
Gas-phase 1H NMR studies of keto-enol tautomerism of acetylacetone, methyl acetoacetate, and ethyl acetoacetate,
J. Phys. Chem., 1985, 89, 3347-3352. [all data]
Martigny, 1990
Martigny, I.,
[Title unavailable], Thesis, Universite Paris VI (1990), 1990. [all data]
Holmes, Lossing, et al., 1991
Holmes, J.L.; Lossing, F.P.; Mayer, P.M.,
Heats of formation of oxygen-containing organic free radicals from appearance energy measurements,
J. Am. Chem. Soc., 1991, 113, 9723. [all data]