Benzoic acid, 4-(methylamino)-
- Formula: C8H9NO2
- Molecular weight: 151.1626
- IUPAC Standard InChIKey: ZVIDMSBTYRSMAR-UHFFFAOYSA-N
- CAS Registry Number: 10541-83-0
- Chemical structure:
View 3d structure (requires JavaScript / HTML 5) - Other names: Benzoic acid, p-(methylamino)-; p-(Methylamino)benzoic acid; N-Methyl-4-aminobenzoic acid; 4-(Methylamino)benzoic acid; 4-(N-Methylamino)benzoic acid; p-(N-Methylamino)benzoic acid

Gas phase ion energetics data

Data compiled as indicated in comments:
LLK - Sharon G. Lias, Rhoda D. Levin, and Sherif A. Kafafi
Ionization energy determinations
IE (eV) | Method | Reference | Comment |
---|---|---|---|
7.3 | PE | Meeks, Wahlborg, et al., 1981 | LLK |
8.1 | PE | Meeks, Wahlborg, et al., 1981 | Vertical value; LLK |

References

Meeks, Wahlborg, et al., 1981
Meeks, J.; Wahlborg, A.; McGlynn, S.P.,
Photoelectron spectroscopy of carbonyls: Benzoic acid and its derivatives,
J. Electron Spectrosc. Relat. Phenom., 1981, 22, 43. [all data]