Acetic acid, chloro-, ethyl ester
- Formula: C4H7ClO2
- Molecular weight: 122.550
- IUPAC Standard InChIKey: VEUUMBGHMNQHGO-UHFFFAOYSA-N
- CAS Registry Number: 105-39-5
- Chemical structure:
View 3d structure (requires JavaScript / HTML 5) - Other names: Chloroacetic acid ethyl ester; Ethyl α-chloroacetate; Ethyl chloroacetate; Ethyl chloroethanoate; Ethyl monochloracetate; Ethyl monochloroacetate; Ethyl chloracetate; Ethylester kyseliny chloroctove; UN 1181; Ethyl ester of chloroacetic acid; 2-Chloroacetic acid ethyl ester; Acetic acid, 2-chloro-, ethyl ester; NSC 8833

Condensed phase thermochemistry data

Data compiled by: Hussein Y. Afeefy, Joel F. Liebman, and Stephen E. Stein
Quantity | Value | Units | Method | Reference | Comment |
---|---|---|---|---|---|
ΔcH°liquid | -2052. | kJ/mol | Ccb | Schjanberg, 1935 |

Phase change data

Data compiled as indicated in comments:
BS - Robert L. Brown and Stephen E. Stein
TRC - Thermodynamics Research Center, NIST Boulder Laboratories, Chris Muzny director
ALS - Hussein Y. Afeefy, Joel F. Liebman, and Stephen E. Stein
AC - William E. Acree, Jr., James S. Chickos
Quantity | Value | Units | Method | Reference | Comment |
---|---|---|---|---|---|
Tboil | 417. ± 1. | K | AVG | N/A | Average of 6 values; Individual data points |
Quantity | Value | Units | Method | Reference | Comment |
ΔvapH° | 49.48 | kJ/mol | N/A | Majer and Svoboda, 1985 | |
ΔvapH° | 49.47 ± 0.08 | kJ/mol | C | Laynez and Wadso, 1972 | ALS |
ΔvapH° | 49.5 ± 0.1 | kJ/mol | C | Laynez, Wadsö, et al., 1972 | AC |
Enthalpy of vaporization
ΔvapH (kJ/mol) | Temperature (K) | Method | Reference | Comment |
---|---|---|---|---|
45. | 289. | A | Stephenson and Malanowski, 1987 | Based on data from 274. to 418. K.; AC |
40.43 | 417.4 | N/A | Majer and Svoboda, 1985 | |
48.5 | 313. | N/A | Nelson, 1928 | Based on data from 298. to 418. K. See also Boublik, Fried, et al., 1984.; AC |
Antoine Equation Parameters
log10(P) = A − (B / (T + C))
P = vapor pressure (bar)
T = temperature (K)
View plot Requires a JavaScript / HTML 5 canvas capable browser.
Temperature (K) | A | B | C | Reference | Comment |
---|---|---|---|---|---|
298. to 419.1 | 4.67881 | 1725.872 | -47.31 | Nelson, 1928 | Coefficents calculated by NIST from author's data. |

Gas phase ion energetics data

Data compiled by: Henry M. Rosenstock, Keith Draxl, Bruce W. Steiner, and John T. Herron
Appearance energy determinations
Ion | AE (eV) | Other Products | Method | Reference | Comment |
---|---|---|---|---|---|
C2H4O2Cl+ | 10.97 | C2H3 | EI | Godbole and Kebarle, 1962 |

Kovats' RI, non-polar column, isothermal

Column type | Active phase | Temperature (C) | I | Reference | Comment |
---|---|---|---|---|---|
Capillary | SE-30 | 100. | 791. | Haken and Korhonen, 1986 | N2; Column length: 25. m; Column diameter: 0.33 mm |
Capillary | SE-30 | 120. | 776. | Haken and Korhonen, 1986 | N2; Column length: 25. m; Column diameter: 0.33 mm |
Capillary | SE-30 | 140. | 774. | Haken and Korhonen, 1986 | N2; Column length: 25. m; Column diameter: 0.33 mm |
Capillary | SE-30 | 80. | 802. | Haken and Korhonen, 1986 | N2; Column length: 25. m; Column diameter: 0.33 mm |
Capillary | SE-30 | 100. | 832. | Haken, Madden, et al., 1983 | Column length: 25. m; Column diameter: 0.22 mm |
Capillary | OV-101 | 80. | 806.4 | Komárek, Hornová, et al., 1982 | N2; Column length: 15. m; Column diameter: 0.22 mm |

Kovats' RI, polar column, isothermal

Column type | Active phase | Temperature (C) | I | Reference | Comment |
---|---|---|---|---|---|
Capillary | OV-351 | 100. | 1302. | Haken and Korhonen, 1986 | N2; Column length: 25. m; Column diameter: 0.32 mm |
Capillary | OV-351 | 120. | 1292. | Haken and Korhonen, 1986 | N2; Column length: 25. m; Column diameter: 0.32 mm |
Capillary | OV-351 | 140. | 1337. | Haken and Korhonen, 1986 | N2; Column length: 25. m; Column diameter: 0.32 mm |
Capillary | OV-351 | 160. | 1355. | Haken and Korhonen, 1986 | N2; Column length: 25. m; Column diameter: 0.32 mm |
Capillary | OV-351 | 180. | 1336. | Haken and Korhonen, 1986 | N2; Column length: 25. m; Column diameter: 0.32 mm |
Capillary | OV-351 | 200. | 1380. | Haken and Korhonen, 1986 | N2; Column length: 25. m; Column diameter: 0.32 mm |

Normal alkane RI, non-polar column, temperature ramp

Column type | Active phase | I | Reference | Comment |
---|---|---|---|---|
Capillary | HP-5 MS | 839. | Kornilova, Ukolov, et al., 2012 | 25. m/0.20 mm/0.33 μm, Helium, 45. C @ 1. min, 5. K/min, 280. C @ 2. min |

Normal alkane RI, non-polar column, custom temperature program

Column type | Active phase | I | Reference | Comment |
---|---|---|---|---|
Capillary | SE-30 | 810. | Vinogradov, 2004 | Program: not specified |

References

Schjanberg, 1935
Schjanberg, E.,
Die Verbrennungswarmen und die Refraktionsdaten einiger chlorsubstituierter Fettsauren und Ester.,
Z. Phys. Chem. Abt. A, 1935, 172, 197-233. [all data]
Majer and Svoboda, 1985
Majer, V.; Svoboda, V.,
Enthalpies of Vaporization of Organic Compounds: A Critical Review and Data Compilation, Blackwell Scientific Publications, Oxford, 1985, 300. [all data]
Laynez and Wadso, 1972
Laynez, J.; Wadso, I.,
Enthalpies of vaporization of organic compounds. IX. Some halogen substituted hydrocarbons and esters,
Acta Chem. Scand., 1972, 26, 3148. [all data]
Laynez, Wadsö, et al., 1972
Laynez, José; Wadsö, Ingemar; Haug, Arne; Songstad, J.; Pilotti, Åke,
Enthalpies of Vaporization of Organic Compounds. IX. Some Halogen Substituted Hydrocarbons and Esters.,
Acta Chem. Scand., 1972, 26, 3148-3152, https://doi.org/10.3891/acta.chem.scand.26-3148
. [all data]
Stephenson and Malanowski, 1987
Stephenson, Richard M.; Malanowski, Stanislaw,
Handbook of the Thermodynamics of Organic Compounds, 1987, https://doi.org/10.1007/978-94-009-3173-2
. [all data]
Nelson, 1928
Nelson, O.A.,
Vapor Pressures of Fumigants: I---Methyl, Ethyl, Isopropyl, and Secondary Butyl Chloroacetates 1,
Ind. Eng. Chem., 1928, 20, 12, 1380-1382, https://doi.org/10.1021/ie50228a034
. [all data]
Boublik, Fried, et al., 1984
Boublik, T.; Fried, V.; Hala, E.,
The Vapour Pressures of Pure Substances: Selected Values of the Temperature Dependence of the Vapour Pressures of Some Pure Substances in the Normal and Low Pressure Region, 2nd ed., Elsevier, New York, 1984, 972. [all data]
Godbole and Kebarle, 1962
Godbole, E.W.; Kebarle, P.,
Ionization and dissociation of deuterated ethyl and isopropyl acetates and ethyl formate under electron impact,
J. Chem. Soc. Faraday Trans., 1962, 58, 1897. [all data]
Haken and Korhonen, 1986
Haken, J.R.; Korhonen, I.O.O.,
Gas chromatography of homologous esters. XXXIII. Capillary chromatography of monochlorinated C1-C8 n-alkyl acetates, chloracetates, dichloroacetates and trichloroacetates,
J. Chromatogr., 1986, 357, 253-271, https://doi.org/10.1016/S0021-9673(01)95828-5
. [all data]
Haken, Madden, et al., 1983
Haken, J.K.; Madden, B.G.; Korhonen, I.O.O.,
Gas chromatography of homologous esters. XX. Capillary column studies of alkyl acetates, chloroacetates, dichloroacetates and trichloroacetates,
J. Chromatogr., 1983, 256, 221-229, https://doi.org/10.1016/S0021-9673(01)88235-2
. [all data]
Komárek, Hornová, et al., 1982
Komárek, K.; Hornová, L.; Churácek, J.,
Glass capillary gas chromatography of homologous series of esters. Separation of homologous series of esters of halogenated carboxylic acids on a glass capillary column with the non-polar stationary silicone phase OV-101,
J. Chromatogr., 1982, 244, 1, 142-147, https://doi.org/10.1016/S0021-9673(00)80131-4
. [all data]
Kornilova, Ukolov, et al., 2012
Kornilova, T.A.; Ukolov, A.I.; Kostikov, R.R.; Zenkevich, I.G.,
Stability of diazocarbonyl compounds under the conditions of gas chromatography and chromatography-mass spectrometry analysis,
Rus. J. General Chem., 2012, 82, 10, 1675-1685, https://doi.org/10.1134/S1070363212100088
. [all data]
Vinogradov, 2004
Vinogradov, B.A.,
Production, composition, properties and application of essential oils, 2004, retrieved from http://viness.narod.ru. [all data]