Propanoic acid, ethyl ester
- Formula: C5H10O2
- Molecular weight: 102.1317
- IUPAC Standard InChIKey: FKRCODPIKNYEAC-UHFFFAOYSA-N
- CAS Registry Number: 105-37-3
- Chemical structure:
View 3d structure (requires JavaScript / HTML 5) - Other names: Propionic acid, ethyl ester; Ethyl propanoate; Ethyl propionate; Propionic ester; Propionic ether; C2H5COOC2H5; Propionate d'ethyle; Ethylester kyseliny propionove; UN 1195; Ethyl ester of propanoic acid; Ethyl n-propionate; n-Ethyl propanoate; NSC 8848

Gas phase thermochemistry data

Data compiled by: Hussein Y. Afeefy, Joel F. Liebman, and Stephen E. Stein
Quantity | Value | Units | Method | Reference | Comment |
---|---|---|---|---|---|
ΔfH°gas | -466.5 ± 0.4 | kJ/mol | Cm | Wiberg and Waldron, 1991 | Heat of hydrolysis |
ΔfH°gas | -463.6 ± 0.7 | kJ/mol | Ccr | Mansson, 1972 |

Condensed phase thermochemistry data

Data compiled as indicated in comments:
ALS - Hussein Y. Afeefy, Joel F. Liebman, and Stephen E. Stein
DH - Eugene S. Domalski and Elizabeth D. Hearing
Quantity | Value | Units | Method | Reference | Comment |
---|---|---|---|---|---|
ΔfH°liquid | -505.59 ± 0.50 | kJ/mol | Cm | Wiberg and Waldron, 1991 | Heat of hydrolysis; ALS |
ΔfH°liquid | -502.7 ± 0.7 | kJ/mol | Ccr | Mansson, 1972 | ALS |
Quantity | Value | Units | Method | Reference | Comment |
ΔcH°liquid | -2894.00 ± 0.65 | kJ/mol | Ccr | Mansson, 1972 | Corresponding ΔfHºliquid = -502.70 kJ/mol (simple calculation by NIST; no Washburn corrections); ALS |
ΔcH°liquid | -2888. | kJ/mol | Ccb | Schjanberg, 1935 | Corresponding ΔfHºliquid = -508.4 kJ/mol (simple calculation by NIST; no Washburn corrections); ALS |
ΔcH°liquid | -2912.1 ± 2.0 | kJ/mol | Ccb | Roth and Muller, 1929 | Corresponding ΔfHºliquid = -484.64 kJ/mol (simple calculation by NIST; no Washburn corrections); ALS |
Constant pressure heat capacity of liquid
Cp,liquid (J/mol*K) | Temperature (K) | Reference | Comment |
---|---|---|---|
199.58 | 298.33 | Zabransky, Hynek, et al., 1987 | T = 294 to 349 K. Unsmoothed experimental datum.; DH |
200.90 | 298.15 | Jimenez, Romani, et al., 1986 | DH |

Phase change data

Data compiled as indicated in comments:
TRC - Thermodynamics Research Center, NIST Boulder Laboratories, Chris Muzny director
BS - Robert L. Brown and Stephen E. Stein
ALS - Hussein Y. Afeefy, Joel F. Liebman, and Stephen E. Stein
DRB - Donald R. Burgess, Jr.
AC - William E. Acree, Jr., James S. Chickos
Quantity | Value | Units | Method | Reference | Comment |
---|---|---|---|---|---|
Tboil | 372.2 ± 0.5 | K | AVG | N/A | Average of 22 out of 25 values; Individual data points |
Quantity | Value | Units | Method | Reference | Comment |
Tfus | 199.25 | K | N/A | Timmermans, 1934 | Uncertainty assigned by TRC = 0.4 K; TRC |
Tfus | 200.24 | K | N/A | Timmermans, 1909 | Uncertainty assigned by TRC = 0.2 K; not clear that this was an independent measurement; TRC |
Quantity | Value | Units | Method | Reference | Comment |
Tc | 548. ± 7. | K | AVG | N/A | Average of 7 values; Individual data points |
Quantity | Value | Units | Method | Reference | Comment |
Pc | 33.62 | bar | N/A | Young, 1910 | Uncertainty assigned by TRC = 0.8106 bar; TRC |
Pc | 33.597 | bar | N/A | Young and Thomas, 1893 | Uncertainty assigned by TRC = 0.40 bar; TRC |
Pc | 35.10 | bar | N/A | Heilbron, 1891 | Uncertainty assigned by TRC = 2.0265 bar; TRC |
Pc | 35.10 | bar | N/A | Nadezhdin, 1887 | Uncertainty assigned by TRC = 2.0265 bar; TRC |
Quantity | Value | Units | Method | Reference | Comment |
ρc | 2.903 | mol/l | N/A | Young, 1910 | Uncertainty assigned by TRC = 0.098 mol/l; TRC |
ρc | 2.907 | mol/l | N/A | Young and Thomas, 1893 | Uncertainty assigned by TRC = 0.04 mol/l; TRC |
ρc | 2.80 | mol/l | N/A | Heilbron, 1891 | Uncertainty assigned by TRC = 0.098 mol/l; TRC |
ρc | 2.80 | mol/l | N/A | Nadezhdin, 1887 | Uncertainty assigned by TRC = 0.098 mol/l; TRC |
Quantity | Value | Units | Method | Reference | Comment |
ΔvapH° | 39.0 ± 0.9 | kJ/mol | AVG | N/A | Average of 8 values; Individual data points |
Enthalpy of vaporization
ΔvapH (kJ/mol) | Temperature (K) | Method | Reference | Comment |
---|---|---|---|---|
33.88 | 372.2 | N/A | Majer and Svoboda, 1985 | |
36.7 | 330. | N/A | Hernández and Ortega, 1997 | Based on data from 315. to 420. K.; AC |
34.4 | 387. | A | Stephenson and Malanowski, 1987 | Based on data from 372. to 538. K.; AC |
38.2 | 321. | A | Stephenson and Malanowski, 1987 | Based on data from 306. to 372. K. See also Polák and Mertl, 1965 and Dykyj, 1972.; AC |
38.2 ± 0.1 | 313. | C | Svoboda, Uchytilová, et al., 1980 | AC |
36.6 ± 0.1 | 336. | C | Svoboda, Veselý, et al., 1977 | AC |
36.0 ± 0.1 | 344. | C | Svoboda, Veselý, et al., 1977 | AC |
35.5 ± 0.1 | 351. | C | Svoboda, Veselý, et al., 1977 | AC |
34.5 ± 0.1 | 363. | C | Svoboda, Veselý, et al., 1977 | AC |
Enthalpy of vaporization
ΔvapH =
A exp(-βTr) (1 − Tr)β
ΔvapH =
Enthalpy of vaporization (at saturation pressure)
(kJ/mol)
Tr = reduced temperature (T / Tc)
View plot Requires a JavaScript / HTML 5 canvas capable browser.
Temperature (K) | A (kJ/mol) | β | Tc (K) | Reference | Comment |
---|---|---|---|---|---|
298. to 363. | 58.36 | 0.2978 | 546. | Majer and Svoboda, 1985 |
Antoine Equation Parameters
log10(P) = A − (B / (T + C))
P = vapor pressure (bar)
T = temperature (K)
View plot Requires a JavaScript / HTML 5 canvas capable browser.
Temperature (K) | A | B | C | Reference | Comment |
---|---|---|---|---|---|
306.93 to 371.46 | 4.14526 | 1274.735 | -64.218 | Polák and Mertl, 1965 | Coefficents calculated by NIST from author's data. |

Reaction thermochemistry data

Data compiled by: Hussein Y. Afeefy, Joel F. Liebman, and Stephen E. Stein
Individual Reactions
By formula: C2H6O + C3H6O2 = C5H10O2 + H2O
Quantity | Value | Units | Method | Reference | Comment |
---|---|---|---|---|---|
ΔrH° | -22.6 ± 0.42 | kJ/mol | Eqk | Essex and Sandholzer, 1938 | liquid phase; Reanalyzed by Cox and Pilcher, 1970, Original value = -23.54 kJ/mol |
By formula: H2 + C5H8O2 = C5H10O2
Quantity | Value | Units | Method | Reference | Comment |
---|---|---|---|---|---|
ΔrH° | -136. ± 4.6 | kJ/mol | Chyd | Vilcu and Perisanu, 1980 | liquid phase |

Henry's Law data

Data compiled by: Rolf Sander
Henry's Law constant (water solution)
kH(T) = k°H exp(d(ln(kH))/d(1/T) ((1/T) - 1/(298.15 K)))
k°H = Henry's law constant for solubility in water at 298.15 K (mol/(kg*bar))
d(ln(kH))/d(1/T) = Temperature dependence constant (K)
k°H (mol/(kg*bar)) | d(ln(kH))/d(1/T) (K) | Method | Reference |
---|---|---|---|
4.6 | V | N/A |

Gas phase ion energetics data

Data compiled by: Henry M. Rosenstock, Keith Draxl, Bruce W. Steiner, and John T. Herron
Ionization energy determinations
IE (eV) | Method | Reference |
---|---|---|
10.00 ± 0.02 | PI | Watanabe, Nakayama, et al., 1962 |
Appearance energy determinations
Ion | AE (eV) | Other Products | Method | Reference | Comment |
---|---|---|---|---|---|
C3H7O2+ | 10.4 ± 0.1 | ? | EI | Munson and Franklin, 1964 |

Kovats' RI, non-polar column, isothermal

Column type | Active phase | Temperature (C) | I | Reference | Comment |
---|---|---|---|---|---|
Capillary | OV-1 | 333. | 694.2 | Hu, Lu, et al., 2006 | |
Capillary | DB-1 | 80. | 678.95 | Mijin and Antonovic, 2006 | 30. m/0.256 mm/0.25 μm, N2 |
Capillary | DB-5 | 80. | 700. | Mijin and Antonovic, 2006 | 60. m/0.321 mm/0.25 μm, N2 |
Packed | SE-30 | 180. | 678. | Oszczapowicz, Ciszkowski, et al., 1986 | N2, Chromosorb W AW; Column length: 3. m |
Capillary | SE-30 | 100. | 692. | Haken and Korhonen, 1985 | Column length: 25. m; Column diameter: 0.33 mm |
Capillary | SE-30 | 120. | 684. | Haken and Korhonen, 1985 | Column length: 25. m; Column diameter: 0.33 mm |
Capillary | SE-30 | 80. | 688. | Haken and Korhonen, 1985 | Column length: 25. m; Column diameter: 0.33 mm |
Capillary | OV-101 | 100. | 695. | Horna, Táborský, et al., 1985 | N2; Column length: 19. m; Column diameter: 0.28 mm |
Capillary | SE-30 | 140. | 707. | Korhonen, 1985 | N2; Column length: 25. m; Column diameter: 0.33 mm |
Packed | SE-30 | 150. | 685. | Tiess, 1984 | Ar, Gas Chrom Q (80-100 mesh); Column length: 3. m |
Capillary | OV-101 | 80. | 694. | Komárek, Hornová, et al., 1983 | Column length: 15. m; Column diameter: 0.22 mm |
Packed | SE-30 | 100. | 691. | Winskowski, 1983 | Gaschrom Q; Column length: 2. m |
Capillary | OV-101 | 80. | 694. | Komárek, Hornová, et al., 1982 | N2; Column length: 15. m; Column diameter: 0.22 mm |
Packed | SE-30 | 150. | 692. | Ashes and Haken, 1974 | Celaton (62-72 mesh); Column length: 3.7 m |
Packed | SE-30 | 100. | 704. | Chastrette, Heintz, et al., 1974 | N2, Chromosorb W AW (60-80 mesh); Column length: 3. m |
Packed | SE-30 | 100. | 695. | Zarazir, Chovin, et al., 1970 | Chromosorb W; Column length: 2. m |
Packed | SE-30 | 150. | 679. | Germaine and Haken, 1969 | Celite 560; Column length: 3.7 m |
Packed | E-301 | 170. | 668. | Shashkova, Znamenskaia, et al., 1969 | He, Celite 545 (0.20-0.50 mm); Column length: 2. m |

Kovats' RI, non-polar column, temperature ramp

Column type | Active phase | I | Reference | Comment |
---|---|---|---|---|
Capillary | DB-1 | 693. | Takeoka, Buttery, et al., 1992 | 60. m/0.32 mm/0.25 μm, He, 30. C @ 4. min, 2. K/min; Tend: 210. C |
Capillary | DB-1 | 692. | Takeoka, Buttery, et al., 1992 | 60. m/0.32 mm/0.25 μm, He, 30. C @ 4. min, 2. K/min; Tend: 210. C |
Capillary | DB-1 | 693. | Takeoka, Buttery, et al., 1992 | 60. m/0.32 mm/0.25 μm, He, 30. C @ 4. min, 2. K/min; Tend: 210. C |
Capillary | DB-1 | 694. | Takeoka, Buttery, et al., 1992 | 60. m/0.32 mm/0.25 μm, He, 30. C @ 4. min, 2. K/min; Tend: 210. C |
Capillary | DB-1 | 699. | Takeoka, Flath, et al., 1990 | 60. m/0.32 mm/0.25 μm, He, 30. C @ 4. min, 2. K/min; Tend: 210. C |
Capillary | DB-1 | 700. | Takeoka, Flath, et al., 1990 | 60. m/0.32 mm/0.25 μm, He, 30. C @ 4. min, 2. K/min; Tend: 210. C |
Capillary | BP-1 | 685. | Bartley and Schwede, 1989 | He, 30. C @ 2. min, 2. K/min; Column length: 50. m; Column diameter: 0.23 mm; Tend: 200. C |
Capillary | OV-101 | 706. | Morales and Duque, 1987 | He, 2. K/min; Column length: 25. m; Column diameter: 0.31 mm; Tstart: 60. C; Tend: 200. C |

Kovats' RI, non-polar column, custom temperature program

Column type | Active phase | I | Reference | Comment |
---|---|---|---|---|
Capillary | SE-30 | 692. | Chretien and Dubois, 1978 | Program: not specified |

Kovats' RI, polar column, isothermal

Column type | Active phase | Temperature (C) | I | Reference | Comment |
---|---|---|---|---|---|
Capillary | OV-351 | 100. | 977. | Haken and Korhonen, 1985 | N2; Column length: 25. m; Column diameter: 0.32 mm |
Capillary | OV-351 | 80. | 957. | Haken and Korhonen, 1985 | N2; Column length: 25. m; Column diameter: 0.32 mm |
Capillary | SP-1000 | 100. | 954. | Horna, Táborský, et al., 1985 | N2; Column length: 46. m; Column diameter: 0.23 mm |
Capillary | OV-351 | 120. | 910. | Korhonen, 1985 | N2; Column length: 25. m; Column diameter: 0.32 mm |
Packed | Carbowax 20M | 100. | 949. | Chastrette, Heintz, et al., 1974 | Chromosorb WAW (60-80 mesh); Column length: 3. m |
Packed | Carbowax 20M | 100. | 970. | Zarazir, Chovin, et al., 1970 | Chromosorb W; Column length: 2. m |
Packed | Polyethylene Glycol | 170. | 936. | Shashkova, Znamenskaia, et al., 1969 | He, Celite 545 (0.20-0.50 mm); Column length: 2. m |

Kovats' RI, polar column, temperature ramp

Column type | Active phase | I | Reference | Comment |
---|---|---|---|---|
Capillary | BP-20 | 977. | Wyllie and Leach, 1990 | 70. C @ 2. min, 4. K/min; Column length: 25. m; Column diameter: 0.32 mm; Tend: 200. C |
Capillary | Carbowax 20M | 955. | Nishimura, Yamaguchi, et al., 1989 | 2. K/min; Column length: 50. m; Column diameter: 0.22 mm; Tstart: 80. C; Tend: 200. C |
Capillary | DB-Wax | 966. | Umano, Shoji, et al., 1986 | N2, 60. C @ 10. min, 2. K/min; Column length: 30. m; Column diameter: 0.25 mm; Tend: 200. C |
Capillary | DB-Wax | 966. | Umano, Shoji, et al., 1986 | N2, 60. C @ 10. min, 2. K/min; Column length: 30. m; Column diameter: 0.25 mm; Tend: 200. C |

Van Den Dool and Kratz RI, non-polar column, temperature ramp

Column type | Active phase | I | Reference | Comment |
---|---|---|---|---|
Capillary | SPB-5 | 709. | Engel and Ratel, 2007 | 60. m/0.32 mm/1. μm, 40. C @ 2. min, 3. K/min, 230. C @ 10. min |
Capillary | DB-5 | 706. | Bylaite and Meyer, 2006 | 30. m/0.25 mm/1. μm, 50. C @ 1. min, 10. K/min, 290. C @ 10. min |
Capillary | DB-5 | 704. | Fang and Qian, 2005 | 30. m/0.32 mm/1. μm, N2, 40. C @ 2. min, 4. K/min, 230. C @ 10. min |
Capillary | HP-5MS | 714. | Pino, Mesa, et al., 2005 | 30. m/0.25 mm/0.25 μm, He, 60. C @ 2. min, 4. K/min, 250. C @ 20. min |
Capillary | CP-Sil 8CB-MS | 709. | Hierro, de la Hoz, et al., 2004 | 60. m/0.25 mm/0.25 μm, 40. C @ 2. min, 4. K/min, 280. C @ 5. min |
Capillary | HP-5 | 711. | Siegmund, Derler, et al., 2004 | 30. m/0.25 mm/1. μm, -30. C @ 1. min, 10. K/min; Tend: 250. C |
Capillary | CP-Sil 8CB-MS | 705. | Bruna, Hierro, et al., 2003 | 60. m/0.25 mm/0.25 μm, 40. C @ 2. min, 4. K/min, 280. C @ 5. min |
Capillary | CP Sil 5 CB | 680. | Pino, Almora, et al., 2003 | 60. m/0.32 mm/0.25 μm, He, 60. C @ 10. min, 3. K/min, 280. C @ 60. min |
Capillary | CP Sil 5 CB | 681. | Pino, Marbot, et al., 2002 | 50. m/0.32 mm/0.4 μm, He, 60. C @ 10. min, 3. K/min, 280. C @ 60. min |
Capillary | DB-5 | 714. | Isidorov, Zenkevich, et al., 2001 | He, 3. K/min; Column length: 30. m; Column diameter: 0.25 mm; Tstart: 50. C; Tend: 250. C |
Capillary | SPB-1 | 696. | Larráyoz, Addis, et al., 2001 | 30. m/0.32 mm/4. μm, He, 45. C @ 13. min, 5. K/min, 240. C @ 5. min |
Capillary | CP Sil 5 CB | 681. | Pino and Marbot, 2001 | 50. m/0.32 mm/0.4 μm, He, 60. C @ 10. min, 3. K/min, 280. C @ 60. min |
Capillary | CP Sil 5 CB | 681. | Pino, Marbot, et al., 2001 | 50. m/0.32 mm/0.4 μm, He, 60. C @ 10. min, 3. K/min, 280. C @ 60. min |
Capillary | SPB-5 | 711. | Verdier-Metz., Coulon, et al., 1998 | 60. m/0.32 mm/1. μm, He, 40. C @ 5. min, 3. K/min, 200. C @ 2. min |
Capillary | DB-5 | 691. | Guichard and Souty, 1988 | H2, 30. C @ 5. min, 1.5 K/min; Column length: 0.32 m; Column diameter: 1. mm; Tend: 180. C |
Capillary | SE-30 | 712. | Korhonen, 1985 | N2, 6. K/min; Column length: 25. m; Column diameter: 0.33 mm; Tstart: 100. C; Tend: 320. C |
Packed | SE-30 | 700. | van den Dool and Kratz, 1963 | Celite; Tstart: 75. C; Tend: 228. C |

Van Den Dool and Kratz RI, non-polar column, custom temperature program

Column type | Active phase | I | Reference | Comment |
---|---|---|---|---|
Capillary | VF-5MS | 708. | Tretyakov, 2011 | 30. m/0.25 mm/0.25 μm, He; Program: Multi-step temperature program; T(initial)=60C; T(final)=270C |
Capillary | DB-5 | 726. | Andrade, Sampaio, et al., 2007 | 30. m/0.25 mm/0.25 μm, He; Program: 40C(2min) => 4C/min => 220C => 20C/min => 280C |
Capillary | BPX-5 | 712. | Dharmawan, Kasapis, et al., 2007 | 30. m/0.25 mm/0.25 μm, He; Program: 35C => 4C/min => 200C => 30C/min => 300C (3min) |
Capillary | DB-5 | 726. | Sampaio and Nogueira, 2006 | 30. m/0.25 mm/0.25 μm; Program: 40C(2min) => 4C/min => 220C => 20C/min => 280C |
Capillary | DB-5 | 725. | Wang, Finn, et al., 2005 | 30. m/0.32 mm/1. μm, He; Program: 40C(2min) => 5C/min => 100C => 4C/min => 230C (10min) |
Capillary | DB-5 | 698. | Klesk, Qian, et al., 2004 | 30. m/0.32 mm/1. μm, He; Program: 40C (2min) => 5C/min => 100C => 4C/min => 230C (10min) |
Capillary | DB-5 | 708. | Beaulieu and Grimm, 2001 | 30. m/0.25 mm/0.25 μm, He; Program: 50C (1min) => 5C/min => 100C => 10C/min => 250C (9min) |
Capillary | HP-5 | 714. | Isidorov, Krajewska, et al., 2001 | 30. m/0.25 mm/0.25 μm, He; Program: 50C => 6C/min => 100C => 4C/min => 280C |
Capillary | SE-54 | 714. | Buettner and Schieberle, 1999 | 30. m/0.32 mm/0.25 μm, He; Program: 35C (2min) => 40C/min => 50C (2min) => 6C/min => 180C => 10C/min => 230C (10min) |
Capillary | BPX-5 | 710. | Bauchot, Mottram, et al., 1998 | 50. m/0.32 mm/0.50 μm, He; Program: 0 0C (8 min) -> (1 min) -> 50 0C (2 min) 2.5 0C/min -> 100 0C 6 0C/min -> 250 0C |
Capillary | SE-54 | 714. | Hinterholzer and Schieberie, 1998 | 30. m/0.32 mm/0.25 μm, He; Program: 35C(2min) => 40C/min => 50C(2min) => 6C/min => 180C => 10C/min => 230C(10min) |

Van Den Dool and Kratz RI, polar column, temperature ramp

Column type | Active phase | I | Reference | Comment |
---|---|---|---|---|
Capillary | DB-Wax | 951. | Gurbuz O., Rouseff J.M., et al., 2006 | 60. m/0.25 mm/0.25 μm, He, 7. K/min, 265. C @ 5. min; Tstart: 40. C |
Capillary | DB-Wax | 946. | Gurbuz O., Rouseff J.M., et al., 2006 | 30. m/0.32 mm/0.5 μm, He, 7. K/min, 265. C @ 5. min; Tstart: 40. C |
Capillary | CP-Wax 52CB | 953. | Kourkoutas, Elmore, et al., 2006 | 60. m/0.25 mm/0.25 μm, He, 4. K/min; Tstart: 40. C; Tend: 250. C |
Capillary | Stabilwax | 955. | Fang and Qian, 2005 | 30. m/0.32 mm/1. μm, N2, 40. C @ 2. min, 4. K/min, 230. C @ 10. min |
Capillary | DB-Wax | 976. | Malliaa, Fernandez-Garcia, et al., 2005 | 60. m/0.32 mm/1. μm, He, 45. C @ 1. min, 5. K/min, 250. C @ 12. min |
Capillary | DB-Wax | 957. | Malliaa, Fernandez-Garcia, et al., 2005 | 60. m/0.32 mm/1. μm, He, 45. C @ 1. min, 5. K/min, 250. C @ 12. min |
Capillary | DB-Wax | 939. | Varming, Andersen, et al., 2004 | 30. m/0.25 mm/0.25 μm, He, 40. C @ 10. min, 6. K/min, 240. C @ 25. min |
Capillary | DB-Wax | 947. | Varming, Petersen, et al., 2004 | 30. m/0.25 mm/0.25 μm, He, 40. C @ 10. min, 6. K/min, 240. C @ 25. min |
Capillary | AT-Wax | 922. | Pino, Almora, et al., 2003 | 60. m/0.32 mm/0.25 μm, He, 65. C @ 10. min, 2. K/min, 250. C @ 60. min |
Capillary | AT-Wax | 925. | Pino, Marbot, et al., 2002 | 60. m/0.32 mm/0.25 μm, He, 65. C @ 10. min, 2. K/min, 250. C @ 60. min |
Capillary | AT-Wax | 928. | Pino and Marbot, 2001 | 60. m/0.32 mm/0.25 μm, He, 65. C @ 10. min, 2. K/min, 250. C @ 60. min |
Capillary | AT-Wax | 925. | Pino, Marbot, et al., 2001 | 60. m/0.32 mm/0.25 μm, He, 65. C @ 10. min, 2. K/min, 250. C @ 60. min |
Capillary | DB-Wax | 961. | Shimoda, Peralta, et al., 1996 | 60. m/0.25 mm/0.25 μm, He, 3. K/min; Tstart: 50. C; Tend: 230. C |
Capillary | DB-Wax | 964. | Stashenko, Macku, et al., 1992 | He, 35. C @ 5. min, 3. K/min; Column length: 60. m; Column diameter: 0.25 mm; Tend: 180. C |
Capillary | DB-Wax | 953. | Umano, Hagi, et al., 1992 | He, 40. C @ 10. min, 2. K/min; Column length: 30. m; Column diameter: 0.25 mm; Tend: 200. C |
Capillary | OV-351 | 970. | Korhonen, 1985 | N2, 6. K/min; Column length: 25. m; Column diameter: 0.32 mm; Tstart: 100. C; Tend: 230. C |
Capillary | Carbowax 20M | 951. | Chen, Kuo, et al., 1982 | He, 50. C @ 10. min, 1. K/min; Tend: 160. C |
Packed | Carbowax 20M | 940. | van den Dool and Kratz, 1963 | Celite 545, 4.6 K/min; Tstart: 75. C; Tend: 228. C |

Van Den Dool and Kratz RI, polar column, custom temperature program

Column type | Active phase | I | Reference | Comment |
---|---|---|---|---|
Capillary | Supelcowax-10 | 960. | Bianchi, Cantoni, et al., 2007 | 30. m/0.25 mm/0.25 μm; Program: 35C(8min) => 4C/min => 60C => 6C/min => 160C => 20C/min => 220C(1min) |
Capillary | Supelcowax-10 | 959. | Bianchi, Careri, et al., 2007 | 30. m/0.25 mm/0.25 μm, He; Program: 35C(8min) => 4C/min => 60C => 6C/min => 160C => 20C/min => 200C(1min) |
Capillary | Supelcowax-10 | 960. | Bianchi, Careri, et al., 2007 | 30. m/0.25 mm/0.25 μm, He; Program: 35C(8min) => 4C/min => 60C => 6C/min => 160C => 20C/min => 200C(1min) |
Capillary | Supelcowax-10 | 957. | Bianchi, Careri, et al., 2007 | 30. m/0.25 mm/0.25 μm, He; Program: 35C(8min) => 4C/min => 60C => 6C/min => 160C => 20C/min => 200C(1min) |
Capillary | Stabilwax | 965. | Wang, Finn, et al., 2005 | 30. m/0.32 mm/1. μm, He; Program: 40C(2min) => 5C/min => 100C => 4C/min => 230C (10min) |
Capillary | Stabilwax | 955. | Wang, Finn, et al., 2005 | 30. m/0.32 mm/1. μm, He; Program: 40C(2min) => 5C/min => 100C => 4C/min => 230C (10min) |
Capillary | DB-Wax | 915. | Ferrari, Lablanquie, et al., 2004 | 60. m/0.25 mm/0.25 μm, He; Program: 35C(0.7min) => 20C/min => 70C => 4C/min => 240C |
Capillary | Stabilwax | 924. | Klesk, Qian, et al., 2004 | 30. m/0.32 mm/1. μm, He; Program: 40C (2min) => 5C/min => 100C => 4C/min => 230C (10min) |
Capillary | FFAP | 951. | Buettner and Schieberle, 1999 | 30. m/0.32 mm/0.25 μm, He; Program: 35C (2min) => 40C/min => 60C (2min) => 6C/min => 180C => 10C/min => 230C (10min) |
Capillary | FFAP | 945. | Yasuhara, 1987 | 50. m/0.25 mm/0.25 μm, He; Program: 20C (5min) => 2C/min => 70C => 4C/min => 210C |
Capillary | Carbowax 20M | 960. | Whitfield, Shea, et al., 1981 | Column length: 150. m; Column diameter: 0.75 mm; Program: not specified |

Normal alkane RI, non-polar column, isothermal

Column type | Active phase | Temperature (C) | I | Reference | Comment |
---|---|---|---|---|---|
Packed | SE-30 | 70. | 702. | Yabumoto, Jennings, et al., 1977 | |
Packed | Apieson L | 120. | 651. | Kurdina, Markovich, et al., 1969 | not specified, not specified |

Normal alkane RI, non-polar column, temperature ramp

Column type | Active phase | I | Reference | Comment |
---|---|---|---|---|
Capillary | DB-5 | 714. | El-Massry, El-Ghorab, et al., 2009 | 30. m/0.25 mm/0.25 μm, Helium, 3. K/min, 220. C @ 40. min; Tstart: 35. C |
Capillary | DB-1 | 690. | Kumazawa, Itobe, et al., 2008 | 30. m/0.25 mm/0.25 μm, He, 5. K/min; Tstart: 30. C; Tend: 210. C |
Capillary | RTX-5 | 729. | Setkova, Risticevic, et al., 2007 | 10. m/0.18 mm/0.2 μm, He, 40. C @ 0.5 min, 50. K/min, 275. C @ 0.5 min |
Capillary | DB-5 | 705. | Xu, Fan, et al., 2007 | 30. m/0.32 mm/0.25 μm, He, 40. C @ 2. min, 4. K/min, 250. C @ 5. min |
Capillary | DB-1 | 683. | Chen, Sheu, et al., 2006 | Nitrogen, 40. C @ 1. min, 2. K/min, 200. C @ 9. min; Column length: 60. m; Column diameter: 0.25 mm |
Capillary | DB-5 | 705. | Fan and Qian, 2006 | 30. m/0.32 mm/1. μm, He, 40. C @ 2. min, 4. K/min, 250. C @ 15. min |
Capillary | HP-5 | 714. | Isidorov, Purzynska, et al., 2006 | 30. m/0.25 mm/0.25 μm, He, 35. C @ 5. min, 3. K/min; Tend: 200. C |
Capillary | DB-5 | 705. | Fan and Qian, 2005 | 30. m/0.32 mm/0.25 μm, N2, 40. C @ 2. min, 4. K/min, 250. C @ 5. min |
Capillary | HP-5 | 717.2 | Leffingwell and Alford, 2005 | 60. m/0.32 mm/0.25 μm, He, 30. C @ 2. min, 2. K/min, 260. C @ 28. min |
Capillary | SPB-5 | 712. | Ledauphin, Guichard, et al., 2003 | 30. m/0.32 mm/0.25 μm, He, 40. C @ 1. min, 5. K/min, 220. C @ 20. min |
Capillary | SPB-1 | 695. | Vichi, Castellote, et al., 2003 | 30. m/0.25 mm/0.25 μm, He, 40. C @ 10. min, 3. K/min; Tend: 200. C |
Capillary | DB-5 | 703. | Meynier, Novelli, et al., 1999 | 30. m/0.32 mm/1. μm, 40. C @ 5. min, 3. K/min; Tend: 200. C |
Capillary | HP-5 | 703. | Larsen and Frisvad, 1995 | 35. C @ 2. min, 6. K/min; Tend: 200. C |
Capillary | HP-1 | 705. | Peters, de Leer, et al., 1994 | 25. m/0.2 mm/0.33 μm, He, 50. C @ 5. min, 8. K/min, 300. C @ 10. min |
Capillary | OV-101 | 691. | Egolf and Jurs, 1993 | 2. K/min; Column length: 50. m; Column diameter: 0.22 mm; Tstart: 80. C; Tend: 200. C |
Capillary | DB-5 | 709. | Shimoda, Shibamoto, et al., 1993 | 60. m/0.25 mm/0.25 μm, He, 40. C @ 2. min, 3. K/min; Tend: 200. C |
Capillary | DB-1 | 691. | Peppard, 1992 | 30. m/0.25 mm/1.0 μm, He, 3. K/min, 250. C @ 30. min; Tstart: 40. C |
Capillary | OV-101 | 691. | Anker, Jurs, et al., 1990 | 2. K/min; Column length: 50. m; Column diameter: 0.28 mm; Tstart: 80. C; Tend: 200. C |
Capillary | SE-30 | 695. | Dirinck, de Pooter, et al., 1981 | N2, 2. K/min; Column length: 200. m; Column diameter: 0.6 mm; Tstart: 20. C; Tend: 220. C |
Packed | Apiezon L | 657. | Dahlmann, Köser, et al., 1979 | Chromosorb G-AW-DMCS, 10. K/min; Column length: 2. m; Tstart: 25. C |
Capillary | OV-1 | 700. | Schreyen, Dirinck, et al., 1979 | N2, 1. K/min; Column length: 183. m; Column diameter: 0.762 mm; Tstart: 0. C; Tend: 230. C |

Normal alkane RI, non-polar column, custom temperature program

Column type | Active phase | I | Reference | Comment |
---|---|---|---|---|
Capillary | Polydimethyl siloxane with 5 % Ph groups | 726. | Robinson, Adams, et al., 2012 | Program: not specified |
Capillary | Polydimethyl siloxane with 5 % Ph groups | 733. | Robinson, Adams, et al., 2012 | Program: not specified |
Capillary | DB-5 | 699. | Miyazaki, Plotto, et al., 2011 | 60. m/0.25 mm/1.00 μm, Helium; Program: 40 0C 4 0C/min -> 230 0C 100 0C/min -> 260 0C (11.7 min) |
Capillary | HP-5 MS | 714. | Fan, Lu, et al., 2009 | 30. m/0.25 mm/0.25 μm, Helium; Program: 40 0C (3 min) 3 0C/min -> 160 0C (2 min) 8 0C/min -> 220 0C (3 min) |
Capillary | HP-5 | 714. | Rotsatschakul, Visesanguan, et al., 2009 | 60. m/0.25 mm/0.25 μm, Helium; Program: 30 0C (2 min) 2 0Cmin -> 60 0C 10 0C/min -> 100 0C 20 0C/min -> 140 0C 10 0C/min -> 200 0C (10 min) |
Capillary | HP-5 | 710. | Qiao, Xie, et al., 2008 | 30. m/0.25 mm/0.25 μm, Helium; Program: 40 0C (3 min) 3 0C/min -> 160 0C (2 min) 8 0C/min -> 220 0C (3 min) |
Capillary | HP-5 | 712. | Qiao, Xie, et al., 2008 | 30. m/0.25 mm/0.25 μm, Helium; Program: not specified |
Capillary | HP-5 | 711. | Zhao, Li, et al., 2008 | 30. m/0.25 mm/0.25 μm; Program: 40 0C (2 min) 5 0C/min -> 80 0C 7 oC/min -> 160 0C 9 0C/min -> 200 0C 20 0C/min -> 280 0C (10 min) |
Capillary | HP-5 | 709. | Zhao, Li, et al., 2008 | 30. m/0.25 mm/0.25 μm; Program: not specified |
Capillary | DB-5 | 708. | Beaulieu and Lancaster, 2007 | 30. m/0.25 mm/0.25 μm; Program: 50C(1min) => 5C/min => 100C => 10C/min => 250C (9min) |
Capillary | Methyl Silicone | 692. | Chen and Feng, 2007 | Program: not specified |
Capillary | VB-5 | 707. | Karlshøj, Nielsen, et al., 2007 | 60. m/0.25 mm/1. μm, He; Program: 35C(1min) => 4C/min => 175C => 10C/min => 260C |
Capillary | SE-30 | 692. | Liu, Liang, et al., 2007 | Program: not specified |
Capillary | HP-5 | 708. | Splivallo, Bossi, et al., 2007 | He; Program: 50C => 3C/min => 200C(10min) => 10C/min => 290C(10min) |
Capillary | DB-5 | 708. | Beaulieu, 2005 | 60. m/0.25 mm/0.25 μm; Program: 50C => 5C/min => 100C => 15C/min => 250C (19C) |
Capillary | CP-Sil5 CB MS | 703. | Iraqi, Vermeulen, et al., 2005 | 50. m/0.32 mm/1.2 μm; Program: 36C(2min) => 20C/min => 85C => 1C/min => 145C => 3C/min => 250C(30min) |
Capillary | HP-5 | 705. | Thierry, Maillard, et al., 2005 | 60. m/0.32 mm/1. μm; Program: not specified |
Capillary | SPB-5 | 714. | Crook, Boylston, et al., 2004 | 30. m/0.25 mm/0.25 μm, He; Program: 30C(3min) => 5C/min => 80C => 4C/min => 95C => 5C/min => 115C => 10C/min => 200C |
Capillary | SE-30 | 691. | Vinogradov, 2004 | Program: not specified |
Capillary | HP-5 | 709. | Jordán, Margaría, et al., 2003 | 30. m/0.25 mm/0.25 μm; Program: 40C(6min) => 2.5C/min => 150C => 90C/min => 250C |
Capillary | HP-5MS | 705. | Martí, Mestres, et al., 2003 | 30. m/0.25 mm/0.25 μm, He; Program: 40C(5min) => 2C/min => 120C => 10C/min => 210C (30min) |
Capillary | DB-5 | 709. | Qian and Reineccius, 2003 | 30. m/0.32 mm/1. μm; Program: 35C(4min) => 2C/min => 130C => 4C/min => 250C |
Capillary | HP-5 | 709. | Jordán, Goodner, et al., 2002 | 30. m/0.25 mm/0.25 μm; Program: not specified |
Capillary | HP-5 | 709. | Jordán, Margaría, et al., 2002 | 30. m/0.25 mm/0.25 μm; Program: 40C (6min) => 2.5C/min => 150C => 90C/min => 250C |
Capillary | Methyl Silicone | 692. | N/A | Program: not specified |
Capillary | HP-5 | 663. | Jordán, Shaw, et al., 2001 | 30. m/0.25 mm/0.25 μm; Program: 40C (6min) => 2.5C/min => 150C => 90C/min => 250C |
Capillary | Methyl Silicone | 694. | Estrada and Gutierrez, 1999 | Program: not specified |
Capillary | Methyl Silicone | 693. | Zenkevich, 1999 | Program: not specified |
Capillary | SPB-1 | 695. | Flanagan, Streete, et al., 1997 | 60. m/0.53 mm/5. μm, He; Program: 40C(6min) => 5C/min => 80C => 10C/min => 200C |
Capillary | DB-5 | 714. | Mateo and Zumalacárregui, 1996 | 50. m/0.32 mm/0.25 μm, He; Program: 40C (10min) => 3C/min => 95C => 10C/min => 270C (10min) |
Capillary | DB-5 | 715. | Mateo and Zumalacárregui, 1996 | 50. m/0.32 mm/0.25 μm, He; Program: 40C (10min) => 3C/min => 95C => 10C/min => 270C (10min) |
Capillary | SPB-1 | 695. | Strete, Ruprah, et al., 1992 | 60. m/0.53 mm/5.0 μm, Helium; Program: 40 0C (6 min) 5 0C/min -> 80 0C 10 0C/min -> 200 0C |
Capillary | SPB-1 | 679. | Strete, Ruprah, et al., 1992 | 60. m/0.53 mm/5.0 μm, Helium; Program: not specified |
Capillary | DB-1 | 692. | Takeoka, Flath, et al., 1988 | 30. m/0.25 mm/0.25 μm, H2; Program: 30C (2min) => 2C/min => 150C => 4C/min => 250C |
Capillary | DB-1 | 693. | Takeoka, Flath, et al., 1988 | 30. m/0.25 mm/0.25 μm, H2; Program: 30C (2min) => 2C/min => 150C => 4C/min => 250C |
Capillary | OV-101 | 691. | Morales and Duque, 1987 | He; Column length: 25. m; Column diameter: 0.31 mm; Program: not specified |
Capillary | OV-101 | 691. | Shibamoto, 1987 | Column length: 50. m; Column diameter: 0.25 mm; Program: not specified |
Capillary | OV-1, SE-30, Methyl silicone, SP-2100, OV-101, DB-1, etc. | 691. | Waggott and Davies, 1984 | Hydrogen; Column length: 50. m; Column diameter: 0.32 mm; Program: not specified |
Capillary | OV-1 | 679. | Ramsey and Flanagan, 1982 | Program: not specified |

Normal alkane RI, polar column, isothermal

Column type | Active phase | Temperature (C) | I | Reference | Comment |
---|---|---|---|---|---|
Packed | Carbowax 20M | 100. | 952. | Yabumoto, Jennings, et al., 1977 |

Normal alkane RI, polar column, temperature ramp

Column type | Active phase | I | Reference | Comment |
---|---|---|---|---|
Capillary | Innowax | 949. | Siristova, Prinosilova, et al., 2012 | 30. m/0.25 mm/0.25 μm, Helium, 40. C @ 1. min, 8. K/min, 250. C @ 2.75 min |
Capillary | VF-Wax MS | 971. | Duarte, Dias, et al., 2010 | 60. m/0.25 mm/0.25 μm, Helium, 60. C @ 5. min, 3. K/min, 220. C @ 25. min |
Capillary | DB-Wax | 956. | Kumazawa, Itobe, et al., 2008 | 30. m/0.25 mm/0.25 μm, He, 5. K/min; Tstart: 30. C; Tend: 210. C |
Capillary | DB-Wax | 953. | Xu, Fan, et al., 2007 | 30. m/0.25 mm/0.25 μm, He, 40. C @ 2. min, 4. K/min, 230. C @ 5. min |
Capillary | DB-Wax | 953. | Fan and Qian, 2006 | 30. m/0.32 mm/0.25 μm, He, 40. C @ 2. min, 4. K/min, 230. C @ 15. min |
Capillary | HP-Innowax | 946. | Komes, Ulrich, et al., 2006 | 30. m/0.25 mm/0.5 μm, He, 40. C @ 3. min, 2. K/min, 200. C @ 15. min |
Capillary | DB-Wax | 931. | Fan and Qian, 2005 | 30. m/0.32 mm/0.25 μm, N2, 40. C @ 2. min, 4. K/min, 230. C @ 5. min |
Capillary | PEG-20M | 950. | Narain, Almeida, et al., 2004 | 50. m/0.20 mm/0.20 μm, 40. C @ 5. min, 3. K/min, 180. C @ 30. min |
Capillary | DB-Wax | 950. | Lee and Noble, 2003 | 30. m/0.25 mm/0.25 μm, He, 40. C @ 4. min, 4. K/min, 185. C @ 20. min |
Capillary | Supelcowax-10 | 952. | Vichi, Castellote, et al., 2003 | 30. m/0.25 mm/0.25 μm, He, 40. C @ 10. min, 3. K/min; Tend: 200. C |
Capillary | DB-Wax | 952. | Hayata, Sakamoto, et al., 2002 | 60. m/0.25 mm/0.25 μm, He, 40. C @ 10. min, 3. K/min, 220. C @ 10. min |
Capillary | FFAP | 955. | Lecanu, Ducruet, et al., 2002 | 30. m/0.32 mm/1. μm, He, 35. C @ 3. min, 5. K/min; Tend: 240. C |
Capillary | HP-FFAP | 955. | Qian and Reineccius, 2002 | 25. m/0.32 mm/0.52 μm, 60. C @ 1. min, 5. K/min, 240. C @ 5. min |
Capillary | DB-Wax | 949. | Umano, Hagi, et al., 2002 | 60. m/0.25 mm/0.25 μm, He, 40. C @ 2. min, 2. K/min; Tend: 200. C |
Capillary | DB-Wax | 945. | Wei, Mura, et al., 2001 | 60. m/0.25 mm/0.25 μm, He, 2. K/min; Tstart: 40. C; Tend: 200. C |
Capillary | Supelcowax-10 | 961. | Girard and Lau, 1995 | 90. m/0.25 mm/0.25 μm, He, 35. C @ 20. min, 2. K/min, 220. C @ 30. min |
Capillary | DB-Wax | 967. | Umano, Hagi, et al., 1995 | He, 40. C @ 2. min, 2. K/min; Column length: 60. m; Column diameter: 0.25 mm; Tend: 200. C |
Capillary | Carbowax 20M | 944. | Egolf and Jurs, 1993 | 2. K/min; Column length: 80. m; Column diameter: 0.2 mm; Tstart: 70. C; Tend: 170. C |
Capillary | CP-Wax 52CB | 940.0 | Chyau, Chen, et al., 1992 | 50. m/0.32 mm/0.22 μm, H2, 50. C @ 5. min, 2. K/min; Tend: 200. C |
Capillary | Carbowax 20M | 944. | Anker, Jurs, et al., 1990 | 2. K/min; Column length: 80. m; Column diameter: 0.2 mm; Tstart: 70. C; Tend: 170. C |
Capillary | DB-Wax | 952. | Takeoka and Butter, 1989 | 60. m/0.32 mm/0.25 μm, He, 30. C @ 4. min, 2. K/min; Tend: 180. C |
Capillary | DB-Wax | 957. | Takeoka and Butter, 1989 | 60. m/0.32 mm/0.25 μm, He, 30. C @ 4. min, 2. K/min; Tend: 180. C |

Normal alkane RI, polar column, custom temperature program

Column type | Active phase | I | Reference | Comment |
---|---|---|---|---|
Capillary | Innowax | 939. | Siristova, Prinosilova, et al., 2012 | 30. m/0.25 mm/0.25 μm, Helium; Program: not specified |
Capillary | SOLGel-Wax | 956. | Johanningsmeier and McFeeters, 2011 | 30. m/0.25 mm/0.25 μm, Helium; Program: 40 0C (2 min) 5 0C/min -> 140 0C 10 0C/min -> 250 0C (3 min) |
Capillary | SOLGel-Wax | 957. | Johanningsmeier and McFeeters, 2011 | 30. m/0.25 mm/0.25 μm, Helium; Program: not specified |
Capillary | DB-Wax | 974. | Miyazaki, Plotto, et al., 2011 | 60. m/0.25 mm/0.50 μm, Helium; Program: 40 0C 4 0C/min -> 230 0C 100 0C/min -> 260 0C (11.7 min) |
Capillary | HP-Innowax | 964. | Xiao, Dai, et al., 2011 | 60. m/0.25 mm/0.25 μm, Helium; Program: 40 0C (2 min) 3 0C/min -> 150 0C 5 0C/min -> 220 0C (5 min) |
Capillary | DB-Wax | 961. | Valappil, Fan, et al., 2009 | 30. m/0.32 mm/0.50 μm, Helium; Program: 40 0C 7 0C/min -> 110 0C 15 0C/min -> 250 0C (3 min) |
Capillary | Supelcowax-10 | 957. | Berard, Bianchi, et al., 2007 | 30. m/0.25 mm/0.25 μm, He; Program: 35C(8min) => 6C/min => 60C => 4C/min => 160C => 20C/min => 200C(1min) |
Capillary | Supelcowax-10 | 959. | Berard, Bianchi, et al., 2007 | 30. m/0.25 mm/0.25 μm, He; Program: 35C(8min) => 6C/min => 60C => 4C/min => 160C => 20C/min => 200C(1min) |
Capillary | DB-Wax | 916. | Tian, Zhang, et al., 2007 | 30. m/0.25 mm/0.25 μm, He; Program: 50 0C (2 min) 6 0C/min -> 150 0C 8 0C/min -> 230 0C (15 min) |
Capillary | Carbowax 20M | 944. | Vinogradov, 2004 | Program: not specified |
Capillary | PEG-20M | 950. | Garruti, Franco, et al., 2003 | 30. m/0.25 mm/0.25 μm; Program: 50C(8min) => 4C/min => 110C => 16C/min => 200C |
Capillary | CP-WAX 57CB | 938. | Martí, Mestres, et al., 2003 | 50. m/0.25 mm/0.2 μm, He; Program: 40C(10min) => 5C/min => 100C => 3C/min => 180C => 20C/min => 210C (10min) |
Capillary | FFAP | 925. | Lopez, Lavilla, et al., 2000 | 50. m/0.2 mm/0.33 μm, N2; Program: 70C(1min) => 3C/min => 142C(2min) => 25C/min => 230C(5min) |
Capillary | Cross-linked FFAP | 925. | Lavilla, Puy, et al., 1999 | 50. m/0.2 mm/0.33 μm, N2; Program: 70C(1min) => 3C/min => 142C (2min) => 25C/min => 230C(5min) |
Capillary | FFAP | 925. | López, Lavilla, et al., 1998 | 50. m/0.2 mm/0.33 μm, N2; Program: 70C (1min) => 3C/min => 142C (2min) => 25C/min => 230C (5min) |
Capillary | DB-Wax | 966. | Peng, Yang, et al., 1991 | Program: not specified |
Capillary | Carbowax 20M | 944. | Shibamoto, 1987 | Column length: 50. m; Column diameter: 0.25 mm; Program: not specified |
Capillary | Carbowax 400, Carbowax 20M, Carbowax 1540, Carbowax 4000, Superox 06, PEG 20M, etc. | 940. | Waggott and Davies, 1984 | Hydrogen; Column length: 50. m; Column diameter: 0.32 mm; Program: not specified |
Capillary | Carbowax 20M | 948. | Ramsey and Flanagan, 1982 | Program: not specified |

References

Wiberg and Waldron, 1991
Wiberg, K.B.; Waldron, R.F.,
Lactones. 2. Enthalpies of hydrolysis, reduction, and formation of the C4-C13 monocyclic lactones. strain energies and conformations,
J. Am. Chem. Soc., 1991, 113, 7697-7705. [all data]
Mansson, 1972
Mansson, M.,
Enthalpies of combustion and formation of ethyl propionate and diethyl carbonate,
J. Chem. Thermodyn., 1972, 4, 865-871. [all data]
Schjanberg, 1935
Schjanberg, E.,
Die Verbrennungswarmen und die Refraktionsdaten einiger chlorsubstituierter Fettsauren und Ester.,
Z. Phys. Chem. Abt. A, 1935, 172, 197-233. [all data]
Roth and Muller, 1929
Roth, W.A.; Muller, Fr.,
Die Zersetzungswarme der Stickstoffwasserstoffsaure,
Ber., 1929, 62, 1188-1194. [all data]
Zabransky, Hynek, et al., 1987
Zabransky, M.; Hynek, V.; Finkeova-Hastabova, J.; Vesely, F.,
Heat capacities of six liquid esters as a function of temperature,
Coll. Czech. Chem. Comm., 1987, 52, 251-256. [all data]
Jimenez, Romani, et al., 1986
Jimenez, E.; Romani, L.; Paz Andrade, M.I.; Roux-Desgranges, G.; Grolier, J.-P.E.,
Molar excess heat capacities and volumes for mixtures of alkanoates with cyclohexane at 25°C,
J. Solution Chem., 1986, 15(11), 879-890. [all data]
Timmermans, 1934
Timmermans, J.,
Theory of Concentrated Solutions XII.,
Bull. Soc. Chim. Belg., 1934, 43, 626. [all data]
Timmermans, 1909
Timmermans, J.,
New Research on the Density of Liquids below Zero.,
Bull. Soc. Chim. Belg., 1909, 22, 427. [all data]
Young, 1910
Young, S.,
The Internal Heat of Vaporization constants of thirty pure substances,
Sci. Proc. R. Dublin Soc., 1910, 12, 374. [all data]
Young and Thomas, 1893
Young, S.; Thomas, G.L.,
The vapour pressures, molecular volumes, and critical constants of ten of the lower esters,
J. Chem. Soc., 1893, 63, 1191. [all data]
Heilbron, 1891
Heilbron, E.,
Summary of the Critical Data Up To Now on Liquids.,
Z. Phys. Chem., Stoechiom. Verwandtschaftsl., 1891, 1, 601-13. [all data]
Nadezhdin, 1887
Nadezhdin, A.,
Rep. Phys., 1887, 23, 708. [all data]
Majer and Svoboda, 1985
Majer, V.; Svoboda, V.,
Enthalpies of Vaporization of Organic Compounds: A Critical Review and Data Compilation, Blackwell Scientific Publications, Oxford, 1985, 300. [all data]
Hernández and Ortega, 1997
Hernández, Pablo; Ortega, Juan,
Vapor-Liquid Equilibria and Densities for Ethyl Esters (Ethanoate to Butanoate) and Alkan-2-ol (C 3 -C 4 ) at 101.32 kPa,
J. Chem. Eng. Data, 1997, 42, 6, 1090-1100, https://doi.org/10.1021/je970077b
. [all data]
Stephenson and Malanowski, 1987
Stephenson, Richard M.; Malanowski, Stanislaw,
Handbook of the Thermodynamics of Organic Compounds, 1987, https://doi.org/10.1007/978-94-009-3173-2
. [all data]
Polák and Mertl, 1965
Polák, J.; Mertl, I.,
Saturated vapour pressure of methyl acetate, ethyl acetate, n-propyl acetate, methyl propionate, and ethyl propionate,
Collect. Czech. Chem. Commun., 1965, 30, 10, 3526-3528, https://doi.org/10.1135/cccc19653526
. [all data]
Dykyj, 1972
Dykyj, J.,
Petrochemia, 1972, 12, 1, 13. [all data]
Svoboda, Uchytilová, et al., 1980
Svoboda, Václav; Uchytilová, Vera; Majer, Vladimír; Pick, Jirí,
Heats of vaporization of alkyl esters of formic, acetic and propionic acids,
Collect. Czech. Chem. Commun., 1980, 45, 12, 3233-3240, https://doi.org/10.1135/cccc19803233
. [all data]
Svoboda, Veselý, et al., 1977
Svoboda, V.; Veselý, F.; Holub, R.; Pick, J.,
Heats of vaporization of alkyl acetates and propionates,
Collect. Czech. Chem. Commun., 1977, 42, 3, 943-951, https://doi.org/10.1135/cccc19770943
. [all data]
Essex and Sandholzer, 1938
Essex, H.; Sandholzer, M.,
The free energy of formation of ethyl propionate,
J. Phys. Chem., 1938, 42, 317-333. [all data]
Cox and Pilcher, 1970
Cox, J.D.; Pilcher, G.,
Thermochemistry of Organic and Organometallic Compounds, Academic Press, New York, 1970, 1-636. [all data]
Vilcu and Perisanu, 1980
Vilcu, R.; Perisanu, S.,
The ideal gas state enthalpies of formation of some monomers,
Rev. Roum. Chim., 1980, 25, 619-624. [all data]
Watanabe, Nakayama, et al., 1962
Watanabe, K.; Nakayama, T.; Mottl, J.,
Ionization potentials of some molecules,
J. Quant. Spectry. Radiative Transfer, 1962, 2, 369. [all data]
Munson and Franklin, 1964
Munson, M.S.B.; Franklin, J.L.,
Energetics of some gaseous oxygenated organic ions,
J. Phys. Chem., 1964, 68, 3191. [all data]
Hu, Lu, et al., 2006
Hu, X.-F.; Lu, C.-H.; Yin, C.-S.,
Modeling Gas Chromatographic Retention Indices of Oxygen-containing Compounds by Novel Atom-type Topological Indices,
Chinese Journal of Chemical Physics, 2006, 19, 3, 243-247, https://doi.org/10.1360/cjcp2006.19(3).243.5
. [all data]
Mijin and Antonovic, 2006
Mijin, D.; Antonovic, D.G.,
The temperature dependence of the retention index for n-alkyl esters of acetic, propionic, cyclohexanecarboxylic, benzoic and phenylacetic acid on DB-1 and DB-5 capillary columns,
J. Serb. Chem. Soc., 2006, 71, 6, 629-637, https://doi.org/10.2298/JSC0606629M
. [all data]
Oszczapowicz, Ciszkowski, et al., 1986
Oszczapowicz, J.; Ciszkowski, K.; Osek, J.,
Amidines. XXVI. Retention indices of N1,N1-dimethylpropionamidines, isobutyramidines, pivalamidines and phenylacetamidines on a non-polar column,
J. Chromatogr., 1986, 362, 383-389, https://doi.org/10.1016/S0021-9673(01)86990-9
. [all data]
Haken and Korhonen, 1985
Haken, J.K.; Korhonen, I.O.O.,
Gas chromatography of homologous esters. XXVII. Retention increments of C1-C18 primary alkanols and their 2-chloropropanoyl and 3-chloropropanoyl derivatives on SE-30 and OV-351 capillary columns,
J. Chromatogr., 1985, 319, 131-142, https://doi.org/10.1016/S0021-9673(01)90548-5
. [all data]
Horna, Táborský, et al., 1985
Horna, A.; Táborský, J.; Churácek, J.; Dufka, O.,
Chromatography of monomers. IV. Gas-liquid chromatographic studies of C1-C6 n-alkyl and C3-C6 isoalkyl acrylates and their hydrogen halide and halogen addition derivatives,
J. Chromatogr., 1985, 348, 141-149, https://doi.org/10.1016/S0021-9673(01)92447-1
. [all data]
Korhonen, 1985
Korhonen, I.O.O.,
Gas-liquid chromatographic analyses. XLIII. Retention increments for 2-chloro-, 2,2-dichloro- and 2,2,2-trichloroethyl esters of aliphatic C2-C20 n-alkanoic acids on SE-30 and OV-351 capillary columns,
J. Chromatogr., 1985, 329, 43-56, https://doi.org/10.1016/S0021-9673(01)81894-X
. [all data]
Tiess, 1984
Tiess, D.,
Gaschromatographische Retentionsindices von 125 leicht- bis mittelflüchtigen organischen Substanzen toxikologisch-analytischer Relevanz auf SE-30,
Wiss. Z. Wilhelm-Pieck-Univ. Rostock Math. Naturwiss. Reihe, 1984, 33, 6-9. [all data]
Komárek, Hornová, et al., 1983
Komárek, K.; Hornová, L.; Horna, A.; Churácek, J.,
Glass capillary gas chromatography of homologous series of esters. III. Separation of alkyl halogenopropionates and halogenobutyrates on OV-101,
J. Chromatogr., 1983, 262, 316-320, https://doi.org/10.1016/S0021-9673(01)88112-7
. [all data]
Winskowski, 1983
Winskowski, J.,
Gaschromatographische Identifizierung von Stoffen anhand von Indexziffem und unterschiedlichen Detektoren,
Chromatographia, 1983, 17, 3, 160-165, https://doi.org/10.1007/BF02271041
. [all data]
Komárek, Hornová, et al., 1982
Komárek, K.; Hornová, L.; Churácek, J.,
Glass capillary gas chromatography of homologous series of esters. II. Separation of homologous series of halogenoethyl esters of aliphatic monocarboxylic acids on OV-101,
J. Chromatogr., 1982, 252, 293-296, https://doi.org/10.1016/S0021-9673(01)88420-X
. [all data]
Ashes and Haken, 1974
Ashes, J.R.; Haken, J.K.,
Gas chromatography of homologous esters. VI. Structure-retention increments of aliphatic esters,
J. Chromatogr., 1974, 101, 1, 103-123, https://doi.org/10.1016/S0021-9673(01)94737-5
. [all data]
Chastrette, Heintz, et al., 1974
Chastrette, M.; Heintz, M.; Druilhe, A.; Lefort, D.,
Analyse chromatographique d'esters aliphatiques saturés. Relations rétention-structure et prévision de la rétention,
Bull. Soc. Chim. Fr., 1974, 9/10,Pt.1, 1852-1856. [all data]
Zarazir, Chovin, et al., 1970
Zarazir, D.; Chovin, P.; Guiochon, G.,
Identification of hydroxylic compounds and their derivatives by gas chromatography,
Chromatographia, 1970, 3, 4, 180-195, https://doi.org/10.1007/BF02269018
. [all data]
Germaine and Haken, 1969
Germaine, R.W.; Haken, J.K.,
Gas chromatography of homologous esters. Part 1. Simple aliphatic esters,
J. Chromatogr., 1969, 43, 33-42, https://doi.org/10.1016/S0021-9673(00)99162-3
. [all data]
Shashkova, Znamenskaia, et al., 1969
Shashkova, A.A.; Znamenskaia, A.P.; Pas'ko, L.Ya.,
Investigation of esters of odd series halohenated acids with Kovats indices,
Gazovaya Khromatografiya, 1969, 9, 40-47. [all data]
Takeoka, Buttery, et al., 1992
Takeoka, G.R.; Buttery, R.G.; Flath, R.A.,
Volatile constituents of Asian pear (Pyrus serotina),
J. Agric. Food Chem., 1992, 40, 10, 1925-1929, https://doi.org/10.1021/jf00022a040
. [all data]
Takeoka, Flath, et al., 1990
Takeoka, G.R.; Flath, R.A.; Mon, T.R.; Teranishi, R.; Guentert, M.,
Volatile Constituents of Apricot (Prunus armeniaca),
J. Agric. Food Chem., 1990, 38, 2, 471-477, https://doi.org/10.1021/jf00092a031
. [all data]
Bartley and Schwede, 1989
Bartley, J.P.; Schwede, A.M.,
Production of volatile componds in ripening kiwi fruit (Actinidia chinensis),
J. Agric. Food Chem., 1989, 37, 4, 1023-1025, https://doi.org/10.1021/jf00088a046
. [all data]
Morales and Duque, 1987
Morales, A.L.; Duque, C.,
Aroma constituents of the fruit of the moutain papaya (Carica pubescens) from Colombia,
J. Agric. Food Chem., 1987, 35, 4, 538-540, https://doi.org/10.1021/jf00076a024
. [all data]
Chretien and Dubois, 1978
Chretien, J.R.; Dubois, J-E.,
Topological Analysis: A Technique for the Physico-Chemical Exploitation of Retention Data in Gas-Liquid Chromatography,
J. Chromatogr., 1978, 158, 43-56, https://doi.org/10.1016/S0021-9673(00)89954-9
. [all data]
Wyllie and Leach, 1990
Wyllie, S.G.; Leach, D.N.,
Aroma volatiles of Cucumis melo cv. golden crispy,
J. Agric. Food Chem., 1990, 38, 11, 2042-2044, https://doi.org/10.1021/jf00101a008
. [all data]
Nishimura, Yamaguchi, et al., 1989
Nishimura, O.; Yamaguchi, K.; Mihara, S.; Shibamoto, T.,
Volatile Constituents of Guava Fruits (Psidium guajava L.) and Canned Puree,
J. Agric. Food Chem., 1989, 37, 1, 139-142, https://doi.org/10.1021/jf00085a033
. [all data]
Umano, Shoji, et al., 1986
Umano, K.; Shoji, A.; Hagi, Y.; Shibamoto, T.,
Volatile constituents of peel of quince fruit, Cydonia oblonga Miller,
J. Agric. Food Chem., 1986, 34, 4, 593-596, https://doi.org/10.1021/jf00070a003
. [all data]
Engel and Ratel, 2007
Engel, E.; Ratel, J.,
Correction of the data generated by mass spectrometry analyses of biological tissues: Application to food authentication,
J. Chromatogr. A, 2007, 1154, 1-2, 331-341, https://doi.org/10.1016/j.chroma.2007.02.012
. [all data]
Bylaite and Meyer, 2006
Bylaite, E.; Meyer, A.S.,
· Characterisation of volatile aroma compounds of orange juices by three dynamic and static headspace gas chromatography techniques,
Eur. Food Res. Technol., 2006, 222, 1-2, 176-184, https://doi.org/10.1007/s00217-005-0141-8
. [all data]
Fang and Qian, 2005
Fang, Y.; Qian, M.,
Aroma compounds in Oregon Pinot Noir wine determined by aroma extract dilution analysis (AEDA),
Flavour Fragr. J., 2005, 20, 1, 22-29, https://doi.org/10.1002/ffj.1551
. [all data]
Pino, Mesa, et al., 2005
Pino, J.A.; Mesa, J.; Muñoz, Y.; Martí, M.P.; Marbot, R.,
Volatile components from mango (Mangifera indica L.) cultivars,
J. Agric. Food Chem., 2005, 53, 6, 2213-2223, https://doi.org/10.1021/jf0402633
. [all data]
Hierro, de la Hoz, et al., 2004
Hierro, E.; de la Hoz, L.; Ordóñez, J.A.,
Headspace volatile compounds from salted and occasionally smoked dried meats (cecinas) as affected by animal species,
Food Chem., 2004, 85, 4, 649-657, https://doi.org/10.1016/j.foodchem.2003.07.001
. [all data]
Siegmund, Derler, et al., 2004
Siegmund, B.; Derler, K.; Pfannhauser, W.,
Chemical and sensory effects of glass and laminated carton packages on fruit juice products. Still a controversial topic,
Lebensm. Wiss. Technol., 2004, 37, 4, 481-488, https://doi.org/10.1016/j.lwt.2003.11.005
. [all data]
Bruna, Hierro, et al., 2003
Bruna, J.M.; Hierro, E.M.; de la Hoz, L.; Mottram, D.S.; Fernández, M.; Ordóñez, J.A.,
Changes in selected biochemical and sensory parameters as affected by the superficial inoculation of Penicillium camemberti on dry fermented sausages,
Int. J. Food Microbiol., 2003, 85, 1-2, 111-125, https://doi.org/10.1016/S0168-1605(02)00505-6
. [all data]
Pino, Almora, et al., 2003
Pino, J.; Almora, K.; Marbot, R.,
Volatile components of papaya (Carica papaya L., maradol variety) fruit,
Flavour Fragr. J., 2003, 18, 6, 492-496, https://doi.org/10.1002/ffj.1248
. [all data]
Pino, Marbot, et al., 2002
Pino, J.A.; Marbot, R.; Vázquez, C.,
Characterization of volatile in Cosa Rican Guava [Psidium friedrichsthalianum (Berg) Niedenzu] fruit,
J. Agric. Food Chem., 2002, 50, 21, 6023-6026, https://doi.org/10.1021/jf011456i
. [all data]
Isidorov, Zenkevich, et al., 2001
Isidorov, V.A.; Zenkevich, I.G.; Krajewska, U.; Dubis, E.N.; Jaroszynska, J.; Bal, K.,
Gas chromatographic analysis of essential oils with preliminary partition of components,
Phytochem. Anal., 2001, 12, 2, 87-90, https://doi.org/10.1002/pca.564
. [all data]
Larráyoz, Addis, et al., 2001
Larráyoz, P.; Addis, M.; Gauch, R.; Bosset, J.O.,
Comparison of dynamic headspace and simultaneous distillation extraction techniques used for the analysis of the volatile components in three European PDO ewes milk cheeses,
Int. Dairy J., 2001, 11, 11-12, 911-926, https://doi.org/10.1016/S0958-6946(01)00144-3
. [all data]
Pino and Marbot, 2001
Pino, J.A.; Marbot, R.,
Volatile flavor constituents of acerola (Malpighia emarginata DC.) fruit,
J. Agric. Food Chem., 2001, 49, 12, 5880-5882, https://doi.org/10.1021/jf010270g
. [all data]
Pino, Marbot, et al., 2001
Pino, J.A.; Marbot, R.; Vázquez, C.,
Characterization of volatiles in strawberry guava (Psidium cattleianum Sabine) fruit,
J. Agric. Food Chem., 2001, 49, 12, 5883-5887, https://doi.org/10.1021/jf010414r
. [all data]
Verdier-Metz., Coulon, et al., 1998
Verdier-Metz., I.; Coulon, J.-B.; PPradel, P.; Viallon, C.; Berdague, J.-L.,
Effect of forage conservation (hay or silage) and cow breed on the coagulation properties of milks and on the characteristics of ripened cheeses,
J. Dairy Res., 1998, 65, 1, 9-21, https://doi.org/10.1017/S0022029997002616
. [all data]
Guichard and Souty, 1988
Guichard, E.; Souty, M.,
Comparison of the relative quantities of aroma compounds found in fresh apricot (Prunus armeniaca) from six different varieties,
Z. Lebensm. Unters. Forsch., 1988, 186, 4, 301-307, https://doi.org/10.1007/BF01027031
. [all data]
van den Dool and Kratz, 1963
van den Dool, H.; Kratz, P. Dec.,
A generalization of the retention index system including linear temperature programmed gas-liquid partition chromatography,
J. Chromatogr., 1963, 11, 463-471, https://doi.org/10.1016/S0021-9673(01)80947-X
. [all data]
Tretyakov, 2011
Tretyakov, K.V.,
Retention Data. NIST Mass Spectrometry Data Center., NIST Mass Spectrometry Data Center, 2011. [all data]
Andrade, Sampaio, et al., 2007
Andrade, M.S.; Sampaio, T.S.; Nogueira, P.C.L.; Ribeiro, A.S.; Bittrich, V.; Amaral, M.C.E.,
Volatile compounds of the leaves, flowers and fruits of Kielmeyera rugosa Choisy (Clusiaceae),
Flavour Fragr. J., 2007, 22, 1, 49-52, https://doi.org/10.1002/ffj.1751
. [all data]
Dharmawan, Kasapis, et al., 2007
Dharmawan, J.; Kasapis, S.; Curran, P.; Johnson, J.R.,
Characterization of volatile compounds in selected citrus fruits from Asia. Part I: freshly-squeezed juice,
Flavour Fragr. J., 2007, 22, 3, 228-232, https://doi.org/10.1002/ffj.1790
. [all data]
Sampaio and Nogueira, 2006
Sampaio, T.S.; Nogueira, P.C.L.,
Volatile components of mangaba fruit (Hancornia speciosa Gomes) at three stages of maturity,
Food Chem., 2006, 95, 4, 606-610, https://doi.org/10.1016/j.foodchem.2005.01.038
. [all data]
Wang, Finn, et al., 2005
Wang, Y.; Finn, C.; Qian, M.C.,
Impact of Growing Environment on Chickasaw Blackberry ( Rubus L.) Aroma Evaluated by Gas Chromatography Olfactometry Dilution Analysis,
J. Agric. Food Chem., 2005, 53, 9, 3563-3571, https://doi.org/10.1021/jf048102m
. [all data]
Klesk, Qian, et al., 2004
Klesk, K.; Qian, M.; Martin, R.R.,
Aroma extract dilution analysis of cv. meeker (Rubus idaeus L.) red raspberries from Oregon and Washington,
J. Agric. Food Chem., 2004, 52, 16, 5155-5161, https://doi.org/10.1021/jf0498721
. [all data]
Beaulieu and Grimm, 2001
Beaulieu, J.C.; Grimm, C.C.,
Identification of volatile compounds in cantaloupe at various developmental stages using solid phase microextraction,
J. Agric. Food Chem., 2001, 49, 3, 1345-1352, https://doi.org/10.1021/jf0005768
. [all data]
Isidorov, Krajewska, et al., 2001
Isidorov, V.A.; Krajewska, U.; Dubis, E.N.; Jdanova, M.A.,
Partition coefficients of alkyl aromatic hydrocarbons and esters in a hexane-acetonitrile system,
J. Chromatogr. A, 2001, 923, 1-2, 127-136, https://doi.org/10.1016/S0021-9673(01)00929-3
. [all data]
Buettner and Schieberle, 1999
Buettner, A.; Schieberle, P.,
Characterization of the most odor-active volatiles in fresh, hand squeezed juice of grapefruit (Citrus paradise Macfayden),
J. Agric. Food Chem., 1999, 47, 12, 5189-5193, https://doi.org/10.1021/jf990071l
. [all data]
Bauchot, Mottram, et al., 1998
Bauchot, A.D.; Mottram, D.S.; Dodson, A.T.; John, P.,
Effect of aminocyclopropane-1-carboxylic acid oxidase antisense gene on the formation of volatile esters in cantaloupe charentais melon (Cv. Védrandais),
J. Agric. Food Chem., 1998, 46, 11, 4787-4792, https://doi.org/10.1021/jf980692z
. [all data]
Hinterholzer and Schieberie, 1998
Hinterholzer, A.; Schieberie, P.,
Identification of the most odour-active volatiles in fresh, hand-extracted juice of valencia late oranges by odour dilution techniques,
Flavour Fragr. J., 1998, 13, 1, 49-55, https://doi.org/10.1002/(SICI)1099-1026(199801/02)13:1<49::AID-FFJ691>3.0.CO;2-S
. [all data]
Gurbuz O., Rouseff J.M., et al., 2006
Gurbuz O.; Rouseff J.M.; Rouseff R.L.,
Comparison of aroma volatiles in commercial Merlot and Cabernet Sauvignon wines using gas chromatography - Olfactometry and gas chromatography - Mass spectrometry,
J. Agric. Food Chem., 2006, 54, 11, 3990-3996, https://doi.org/10.1021/jf053278p
. [all data]
Kourkoutas, Elmore, et al., 2006
Kourkoutas, D.; Elmore, J.S.; Mottram, D.S.,
Comparison of the volatile compositions and flavour properties of cantaloupe, Galia and honeydew muskmelons,
Food Chem., 2006, 97, 1, 95-102, https://doi.org/10.1016/j.foodchem.2005.03.026
. [all data]
Malliaa, Fernandez-Garcia, et al., 2005
Malliaa, S.; Fernandez-Garcia, E.; Bosset, J.O.,
Comparison of purge and trap and solid phase microextraction techniques for studying the volatile aroma compounds of three European PDO hard cheeses,
Int. Dairy J., 2005, 15, 6-9, 741-758, https://doi.org/10.1016/j.idairyj.2004.11.007
. [all data]
Varming, Andersen, et al., 2004
Varming, C.; Andersen, M.L.; Poll, L.,
Influence of thermal treatment on black currant (Ribes nigrum L.) juice aroma,
J. Agric. Food Chem., 2004, 52, 25, 7628-7636, https://doi.org/10.1021/jf049435m
. [all data]
Varming, Petersen, et al., 2004
Varming, C.; Petersen, M.A.; Poll, L.,
Comparison of isolation methods for the determination of important aroma compounds in black currant (Ribes nigrum L.) juice, using nasal impact frequency profiling,
J. Agric. Food Chem., 2004, 52, 6, 1647-1652, https://doi.org/10.1021/jf035133t
. [all data]
Shimoda, Peralta, et al., 1996
Shimoda, M.; Peralta, R.R.; Osajima, Y.,
Headspace gas analysis of fish sauce,
J. Agric. Food Chem., 1996, 44, 11, 3601-3605, https://doi.org/10.1021/jf960345u
. [all data]
Stashenko, Macku, et al., 1992
Stashenko, H.; Macku, C.; Shibamato, T.,
Monitoring volatile chemicals formed from must during yeast fermentation,
J. Agric. Food Chem., 1992, 40, 11, 2257-2259, https://doi.org/10.1021/jf00023a040
. [all data]
Umano, Hagi, et al., 1992
Umano, K.; Hagi, Y.; Nakahara, K.; Shoji, A.; Shibamoto, T.,
Volatile constituents of green and ripened pineapple (Aanas comosus [L.] Merr.),
J. Agric. Food Chem., 1992, 40, 4, 599-603, https://doi.org/10.1021/jf00016a014
. [all data]
Chen, Kuo, et al., 1982
Chen, C.-C.; Kuo, M.-C.; Hwang, L.S.; Wu, J.S.-B.; Wu, C.-M.,
Headspace components of passion fruit juice,
J. Agric. Food Chem., 1982, 30, 6, 1211-1215, https://doi.org/10.1021/jf00114a052
. [all data]
Bianchi, Cantoni, et al., 2007
Bianchi, F.; Cantoni, C.; Careri, M.; Chiesa, L.; Musci, M.; Pinna, A.,
Characterization of the aromatic profile for the authentication and differentiation of typical Italian dry-sausages,
Talanta, 2007, 72, 4, 1552-1563, https://doi.org/10.1016/j.talanta.2007.02.019
. [all data]
Bianchi, Careri, et al., 2007
Bianchi, F.; Careri, M.; Mangia, A.; Musci, M.,
Retention indices in the analysis of food aroma volatile compounds in temperature-programmed gas chromatography: Database creation and evaluation of precision and robustness,
J. Sep. Sci., 2007, 39, 4, 563-572, https://doi.org/10.1002/jssc.200600393
. [all data]
Ferrari, Lablanquie, et al., 2004
Ferrari, G.; Lablanquie, O.; Cantagrel, R.; Ledauphin, J.; Payot, T.; Fournier, N.; Guichard, E.,
Determination of key odorant compounds in freshly distilled cognac using GC-O, GC-MS, and sensory evaluation,
J. Agric. Food Chem., 2004, 52, 18, 5670-5676, https://doi.org/10.1021/jf049512d
. [all data]
Yasuhara, 1987
Yasuhara, A.,
Identification of Volatile Compounds in Poultry Manure by Gas Chromatography-Mass Spectrometry,
J. Chromatogr., 1987, 387, 371-378, https://doi.org/10.1016/S0021-9673(01)94539-X
. [all data]
Whitfield, Shea, et al., 1981
Whitfield, F.B.; Shea, S.R.; Gillen, K.J.; Shaw, K.J.,
Volatile components from the roots of Acacia pulchella R.Br. and their effect on Phytophthora cinnamomi rands,
Aust. J. Bot., 1981, 29, 2, 195-208, https://doi.org/10.1071/BT9810195
. [all data]
Yabumoto, Jennings, et al., 1977
Yabumoto, K.; Jennings, W.G.; Yamaguchi, M.,
Gas chromatographic retention as identification criteria,
Anal. Biochem., 1977, 78, 1, 244-251, https://doi.org/10.1016/0003-2697(77)90029-X
. [all data]
Kurdina, Markovich, et al., 1969
Kurdina, Z.G.; Markovich, V.E.; Sakharov, V.M.,
Gas chromatography of cyclic O-containing compounds
in Gas chromatography, Issue # 10, NIITEKhim, Moscow, 1969, 128-133. [all data]
El-Massry, El-Ghorab, et al., 2009
El-Massry, K.F.; El-Ghorab, A.H.; Shaaban, H.A.; Shibamoto, T.,
Chemical compositions and antioxidant/antimicrobial activities of various samples prepared from Schinus terebinthifolius leaves cultivated in Egipt,
J. Agric. Food Chem., 2009, 57, 12, 5265-5270, https://doi.org/10.1021/jf900638c
. [all data]
Kumazawa, Itobe, et al., 2008
Kumazawa, K.; Itobe, T.; Nishimura, O.; Hamaguchi, T.,
A new approach to estimate the in-mouth release characteristics of odorants in chewing gum,
Food Science and Technology Research, 2008, 14, 3, 269-276, https://doi.org/10.3136/fstr.14.269
. [all data]
Setkova, Risticevic, et al., 2007
Setkova, L.; Risticevic, S.; Pawliszyn, J.,
Rapid headspace solid-phase microextraction-gas chromatographic?time-of-flight mass spectrometric method for qualitative profiling of ice wine volatile fraction II: Classification of Canadian and Czech ice wines using statistical evaluation of the data,
J. Chromatogr. A, 2007, 1147, 2, 224-240, https://doi.org/10.1016/j.chroma.2007.02.052
. [all data]
Xu, Fan, et al., 2007
Xu, Y.; Fan, W.; Qian, M.C.,
Characterization of Aroma Compounds in Apple Cider Using Solvent-Assisted Flavor Evaporation and Headspace Solid-Phase Microextraction,
J. Agric. Food Chem., 2007, 55, 8, 3051-3057, https://doi.org/10.1021/jf0631732
. [all data]
Chen, Sheu, et al., 2006
Chen, H.-C.; Sheu, M.-J.; Wu, C.-M.,
Characterization of Volatiles in Guava (Psidium guajava L. cv. Chung-Shan-Yueh-Pa) Fruit from Taiwan,
J. Food Drug. Anal., 2006, 14, 4, 398-402. [all data]
Fan and Qian, 2006
Fan, W.; Qian, M.C.,
Characterization of Aroma Compounds of Chinese Wuliangye and Jiannanchun Liquors by Aroma Extract Dilution Analysis,
J. Agric. Food Chem., 2006, 54, 7, 2695-2704, https://doi.org/10.1021/jf052635t
. [all data]
Isidorov, Purzynska, et al., 2006
Isidorov, V.; Purzynska, A.; Modzelewska, A.; Serowiecka, M.,
Distribution coefficients of aliphatic alcohols, carbonyl compounds and esters between air and Carboxen/polydimethylsiloxane fiber coating,
Anal. Chim. Acta., 2006, 560, 1-2, 103-109, https://doi.org/10.1016/j.aca.2005.12.043
. [all data]
Fan and Qian, 2005
Fan, W.; Qian, M.C.,
Headspace Solid Phase Microextraction and Gas Chromatography-Olfactometry Dilution Analysis of Young and Aged Chinese Yanghe Daqu Liquors,
J. Agric. Food Chem., 2005, 53, 20, 7931-7938, https://doi.org/10.1021/jf051011k
. [all data]
Leffingwell and Alford, 2005
Leffingwell, J.C.; Alford, E.D.,
Volatile constituents of Perique tobacco,
Electron. J. Environ. Agric. Food Chem., 2005, 4, 2, 899-915. [all data]
Ledauphin, Guichard, et al., 2003
Ledauphin, J.; Guichard, H.; Saint-Clair, J.-F.; Picoche, B.; Barillier, D.,
Chemical and sensorial aroma characterization of freshly distilled calvados. 2. Identification of volatile compounds and key odorants,
J. Agric. Food Chem., 2003, 51, 2, 433-442, https://doi.org/10.1021/jf020373e
. [all data]
Vichi, Castellote, et al., 2003
Vichi, S.; Castellote, A.I.; Pizzale, L.; Conte, L.S.; Buxaderas, S.; López-Tamames, E.,
Analysis of virgin olive oil volatile compounds by headspace solid-phase microextraction coupled to gas chromatography with mass spectrometric and flame ionization detection,
J. Chromatogr. A, 2003, 983, 1-2, 19-33, https://doi.org/10.1016/S0021-9673(02)01691-6
. [all data]
Meynier, Novelli, et al., 1999
Meynier, A.; Novelli, E.; Chissolinim, R.; Zanardi, E.; Gandemer, G.,
Volatile compounds of commercial Milano salami,
Meat Sci., 1999, 51, 2, 175-183, https://doi.org/10.1016/S0309-1740(98)00122-3
. [all data]
Larsen and Frisvad, 1995
Larsen, T.O.; Frisvad, J.C.,
Characterization of volatile metabolites from 47 Penicillium taxa,
Mycol. Res., 1995, 99, 10, 1153-1166, https://doi.org/10.1016/S0953-7562(09)80271-2
. [all data]
Peters, de Leer, et al., 1994
Peters, R.J.D.; de Leer, E.W.B.; Versteegh, J.F.M.,
Identification of Halogenated Compounds Produced by Chlorination of Humic Acid in the Presence of Bromide,
J. Chromatogr. A, 1994, 686, 2, 253-261, https://doi.org/10.1016/0021-9673(94)00719-5
. [all data]
Egolf and Jurs, 1993
Egolf, L.M.; Jurs, P.C.,
Quantitative structure-retention and structure-odor intensity relationships for a diverse group of odor-active compounds,
Anal. Chem., 1993, 65, 21, 3119-3126, https://doi.org/10.1021/ac00069a027
. [all data]
Shimoda, Shibamoto, et al., 1993
Shimoda, M.; Shibamoto, T.; Noble, A.C.,
Evaluation of heaspace volatiles of Cabernet Sauvignon wines sampled by an on-column method,
J. Agric. Food Chem., 1993, 41, 10, 1664-1668, https://doi.org/10.1021/jf00034a028
. [all data]
Peppard, 1992
Peppard, T.L.,
Volatile flavor constituents of Monstera deliciosa,
J. Agric. Food Chem., 1992, 40, 2, 257-262, https://doi.org/10.1021/jf00014a018
. [all data]
Anker, Jurs, et al., 1990
Anker, L.S.; Jurs, P.C.; Edwards, P.A.,
Quantitative structure-retention relationship studies of odor-active aliphatic compounds with oxygen-containing functional groups,
Anal. Chem., 1990, 62, 24, 2676-2684, https://doi.org/10.1021/ac00223a006
. [all data]
Dirinck, de Pooter, et al., 1981
Dirinck, P.J.; de Pooter, H.L.; Willaert, G.A.; Schamp, N.M.,
Flavor quality of cultivated strawberries: the role of the sulfur compounds,
J. Agric. Food Chem., 1981, 29, 2, 316-321, https://doi.org/10.1021/jf00104a024
. [all data]
Dahlmann, Köser, et al., 1979
Dahlmann, G.; Köser, H.J.K.; Oelert, H.H.,
Multiple korrelation von retentionsindizes,
Chromatographia, 1979, 12, 10, 665-671, https://doi.org/10.1007/BF02302943
. [all data]
Schreyen, Dirinck, et al., 1979
Schreyen, L.; Dirinck, P.; Sandra, P.; Schamp, N.,
Flavor analysis of quince,
J. Agric. Food Chem., 1979, 27, 4, 872-876, https://doi.org/10.1021/jf60224a058
. [all data]
Robinson, Adams, et al., 2012
Robinson, A.L.; Adams, D.O.; Boss, P.K.; Heymann, H.; Solomon, P.S.; Trengove, R.D.,
Influence of geographic origine on the sensory characteristics and wine composition of Vitus viniferas cv. Cabernet Sauvignon wines from Australia (Supplemental data),
Am. J. Enol. Vitic., 2012, 64, 4, 467-476, https://doi.org/10.5344/ajev.2012.12023
. [all data]
Miyazaki, Plotto, et al., 2011
Miyazaki, T.; Plotto, A.; Goodner, K.; Gmitter F.G.,
Distribution of aroma volatile compounds in tangerine hybrids and proposed inheritance,
J. Sci. Food Agric., 2011, 91, 3, 449-460, https://doi.org/10.1002/jsfa.4205
. [all data]
Fan, Lu, et al., 2009
Fan, G.; Lu, W.; Yao, X.; Zhang, Y.; Wang, K.; Pan, S.,
effect of fermentation on free and bound volatile compounds of orange juice,
Flavour Fragr. J., 2009, 24, 5, 219-229, https://doi.org/10.1002/ffj.1931
. [all data]
Rotsatschakul, Visesanguan, et al., 2009
Rotsatschakul, P.; Visesanguan, W.; Smitinont, T.; Chaiseri, S.,
Changes in volatile compounds during fermentation of nham (Thai fermented sausage),
Int. Food Res. J., 2009, 16, 391-414. [all data]
Qiao, Xie, et al., 2008
Qiao, Y.; Xie, B.J.; Zhang, Y.; Zhang, Y.; FAn, G.; Yao, X.L.; Pan, S.Y.,
Characterization of aroma active compounds in fruit juice and peel oil of Junchen sweet orange fruit (Citrus sinensis (L.) Osbeck) by GC-MS and GC-O,
Molecules, 2008, 13, 6, 1333-1344, https://doi.org/10.3390/molecules13061333
. [all data]
Zhao, Li, et al., 2008
Zhao, Y.; Li, J.; Xu, Y.; Duan, H.; Fan, W.; Zhao, G.,
EXtraction, preparation and identification of volatile compounds in Changyu XO brandy,
Chinese J. Chromatogr., 2008, 26, 2, 212-222, https://doi.org/10.1016/S1872-2059(08)60014-0
. [all data]
Beaulieu and Lancaster, 2007
Beaulieu, J.C.; Lancaster, V.A.,
Correlating Volatile Compounds, Sensory Attributes, and Quality Parameters in Stored Fresh-Cut Cantaloupe,
J. Agric. Food Chem., 2007, 55, 23, 9503-9513, https://doi.org/10.1021/jf070282n
. [all data]
Chen and Feng, 2007
Chen, Y.; Feng, C.,
QSPR study on gas chromatography retention index of some organic pollutants,
Comput. Appl. Chem. (China), 2007, 24, 10, 1404-1408. [all data]
Karlshøj, Nielsen, et al., 2007
Karlshøj, K.; Nielsen, P.V.; Larsen, T.O.,
Prediction of Penicillium expansum Spoilage and Patulin Concentration in Apples Used for Apple Juice Production by Electronic Nose Analysis,
J. Agric. Food Chem., 2007, 55, 11, 4289-4298, https://doi.org/10.1021/jf070134x
. [all data]
Liu, Liang, et al., 2007
Liu, F.; Liang, Y.; Cao, C.; Zhou, N.,
QSPR study of GC retention indices for saturated esters on seven stationary phases based on novel topological indices,
Talanta, 2007, 72, 4, 1307-1315, https://doi.org/10.1016/j.talanta.2007.01.038
. [all data]
Splivallo, Bossi, et al., 2007
Splivallo, R.; Bossi, S.; Maffei, M.; Bonfante, P.,
Discrimination of truffle fruiting body versus mycelial aromas by stir bar sorptive extraction,
Phytochemistry, 2007, 68, 20, 2584-2598, https://doi.org/10.1016/j.phytochem.2007.03.030
. [all data]
Beaulieu, 2005
Beaulieu, J.C.,
Within-Season Volatile and Quality Differences in Stored Fresh-Cut Cantaloupe Cultivars,
J. Agric. Food Chem., 2005, 53, 22, 8679-8687, https://doi.org/10.1021/jf050241w
. [all data]
Iraqi, Vermeulen, et al., 2005
Iraqi, R.; Vermeulen, C.; Benzekri, A.; Bouseta, A.; Collin, S.,
Screening for key odorants in Moroccan green olives by gas chromatography-olfactometry/aroma extract dilution analysis,
J. Agric. Food Chem., 2005, 53, 4, 1179-1184, https://doi.org/10.1021/jf040349w
. [all data]
Thierry, Maillard, et al., 2005
Thierry, A.; Maillard, M.-B.; Bonnarme, P.; Roussel, E.,
The addition of Propionibacterium freudenreichii to raclette cheese induces biochemical changes and enhances flavor development,
J. Agric. Food Chem., 2005, 53, 10, 4157-4165, https://doi.org/10.1021/jf0481195
. [all data]
Crook, Boylston, et al., 2004
Crook, L.R.; Boylston, T.D.; Glatz, B.A.,
Effect of gas environment and sorbate addition on flavor characteristics of irradiated apple cider during storage,
J. Agric. Food Chem., 2004, 52, 23, 6997-7004, https://doi.org/10.1021/jf049454w
. [all data]
Vinogradov, 2004
Vinogradov, B.A.,
Production, composition, properties and application of essential oils, 2004, retrieved from http://viness.narod.ru. [all data]
Jordán, Margaría, et al., 2003
Jordán, M.J.; Margaría, C.A.; Shaw, P.E.; Goodner, K.L.,
Volatile components and aroma active compounds in aqueous essence and fresh pink guava fruid puree (Psidium guajava L.) by GC-MS and multidimensional GC/GC-O,
J. Agric. Food Chem., 2003, 51, 5, 1421-1426, https://doi.org/10.1021/jf020765l
. [all data]
Martí, Mestres, et al., 2003
Martí, M.P.; Mestres, M.; Sala, C.; Busto, O.; Guasch, J.,
Solid-phase microextraction and gas chromatography olfactometry analysis of successively diluted samples. A new approach of the aroma extract dilution analysis applied to the characterization of wine aroma,
J. Agric. Food Chem., 2003, 51, 27, 7861-7865, https://doi.org/10.1021/jf0345604
. [all data]
Qian and Reineccius, 2003
Qian, M.; Reineccius, G.,
Potent aroma compounds in Parmigiano Reggiano cheese studied using a dynamic headspace (purge-trap) method,
Flavour Fragr. J., 2003, 18, 3, 252-259, https://doi.org/10.1002/ffj.1194
. [all data]
Jordán, Goodner, et al., 2002
Jordán, M.J.; Goodner, K.L.; Shaw, P.E.,
Characterization of the aromatic profile in aqueous essence and fruit juice of yellow passion fruit (Passiflora edulis Sims F. Flavicarpa degner) by GC-MS and GC/O,
J. Agric. Food Chem., 2002, 50, 6, 1523-1528, https://doi.org/10.1021/jf011077p
. [all data]
Jordán, Margaría, et al., 2002
Jordán, M.J.; Margaría, C.A.; Shaw, P.E.; Goodner, K.L.,
Aroma active components in aqueous kiwi fruit essence and kiwi fruit puree by GC-MS and multidimensional GC/GC-O,
J. Agric. Food Chem., 2002, 50, 19, 5386-5390, https://doi.org/10.1021/jf020297f
. [all data]
Jordán, Shaw, et al., 2001
Jordán, M.J.; Shaw, P.E.; Goodner, K.L.,
Volatile components in aqueous essence and fresh fruit of Cucumis melo cv. Athena (muskmelon) by GC-MS and GC-O,
J. Agric. Food Chem., 2001, 49, 12, 5929-5933, https://doi.org/10.1021/jf010954o
. [all data]
Estrada and Gutierrez, 1999
Estrada, E.; Gutierrez, Y.,
Modeling chromatographic parameters by a novel graph theoretical sub-structural approach,
J. Chromatogr. A, 1999, 858, 2, 187-199, https://doi.org/10.1016/S0021-9673(99)00808-0
. [all data]
Zenkevich, 1999
Zenkevich, I.G.,
Mutual Correlation between Gas-Chromatographic Retention Indices of Organic Compounds from Different Series,
Zh. Anal. Khim., 1999, 54, 12, 1272-1279. [all data]
Flanagan, Streete, et al., 1997
Flanagan, R.J.; Streete, P.J.; Ramsey, J.D.,
Volatile Substance Abuse, UNODC Technical Series, No 5, United Nations, Office on Drugs and Crime, Vienna International Centre, PO Box 500, A-1400 Vienna, Austria, 1997, 56, retrieved from http://www.odccp.org/pdf/technicalseries1997-01-011.pdf. [all data]
Mateo and Zumalacárregui, 1996
Mateo, J.; Zumalacárregui, J.M.,
Volatile compounds in chorizo and their changes during ripening,
Meat Sci., 1996, 44, 4, 255-273, https://doi.org/10.1016/S0309-1740(96)00028-9
. [all data]
Strete, Ruprah, et al., 1992
Strete, P.J.; Ruprah, M.; Ramsey, J.D.; Flanagan, R.J.,
Detection and identification of volatile substances by headspace capillary gas chromatography to aid the diagnosis of acute poisoning,
Analyst, 1992, 117, 7, 1111-1127, https://doi.org/10.1039/an9921701111
. [all data]
Takeoka, Flath, et al., 1988
Takeoka, G.R.; Flath, R.A.; Güntert, M.; Jennings, W.,
Nectarine volatiles: vacuum steam distillation versus headspace sampling,
J. Agric. Food Chem., 1988, 36, 3, 553-560, https://doi.org/10.1021/jf00081a037
. [all data]
Shibamoto, 1987
Shibamoto, T.,
Retention Indices in Essential Oil Analysis
in Capillary Gas Chromatography in Essential Oil Analysis, Sandra, P.; Bicchi, C., ed(s)., Hutchig Verlag, Heidelberg, New York, 1987, 259-274. [all data]
Waggott and Davies, 1984
Waggott, A.; Davies, I.W.,
Identification of organic pollutants using linear temperature programmed retention indices (LTPRIs) - Part II, 1984, retrieved from http://dwi.defra.gov.uk/research/completed-research/reports/dwi0383.pdf. [all data]
Ramsey and Flanagan, 1982
Ramsey, J.D.; Flanagan, R.J.,
Detection and Identification of Volatile Organic Compounds in Blood by Headspace Gas Chromatography as an Aid to the Diagnosis of Solvent Abuse,
J. Chromatogr., 1982, 240, 2, 423-444, https://doi.org/10.1016/S0021-9673(00)99622-5
. [all data]
Siristova, Prinosilova, et al., 2012
Siristova, L.; Prinosilova, S.; Riddellova, K.; Hajslova, J.; Malzoch, K.,
Changes in quality parameters of vodka filtered through activated charcoal,
Czech J. Food Sci., 2012, 30, 5, 474-482. [all data]
Duarte, Dias, et al., 2010
Duarte, W.F.; Dias, D.R.; Oliveira, J.M.; Teixeira, J.A.; de Almeida e Silva, J.B.; Schwan, R.F.,
Characterization of different fruit wines made from cacao,cupuassu, gabiroba, jaboticaba and umbu,
Food Sci. Technol., 2010, 43, 1564-1572. [all data]
Komes, Ulrich, et al., 2006
Komes, D.; Ulrich, D.; Lovric, T.,
Characterization of odor-active compounds in Croatian Rhine Riesling wine, subregion Zagorje,
Eur. Food Res. Technol., 2006, 222, 1-2, 1-7, https://doi.org/10.1007/s00217-005-0094-y
. [all data]
Narain, Almeida, et al., 2004
Narain, N.; Almeida, J.N.; Galvão, M.S.; Madruga, M.S.; de Brito, E.S.,
Volatile compounds in passion fruit (Passiflora edulis forma Flavicarpa) and yellow mombin (Spondias mombin L.) fruits obtained by dynamic headspace technique,
Cienc. Tecnol. Aliment. Campinas, 2004, 24, 2, 212-216, https://doi.org/10.1590/S0101-20612004000200009
. [all data]
Lee and Noble, 2003
Lee, S.-J.; Noble, A.C.,
Characterization of odor-active compounds in Californian Chardonnay wines using GC-olfactometry and GC-mass spectrometry,
J. Agric. Food Chem., 2003, 51, 27, 8036-8044, https://doi.org/10.1021/jf034747v
. [all data]
Hayata, Sakamoto, et al., 2002
Hayata, Y.; Sakamoto, T.; Kozuka, H.; Sakamoto, K.; Osajima, Y.,
Analysis of aromatic volatile compounds in 'Miyabi' melon (Cucumis melo L.) using the Porapak Q column,
J. Jpn. Soc. Hortic. Sci., 2002, 71, 4, 517-525, https://doi.org/10.2503/jjshs.71.517
. [all data]
Lecanu, Ducruet, et al., 2002
Lecanu, L.; Ducruet, V.; Jouquand, C.; Gratadoux, J.J.; Feigenbaum, A.,
Optimization of headspace solid-phase microextraction (SPME) for the odor analysis of surface-ripened cheese,
J. Agric. Food Chem., 2002, 50, 13, 3810-3817, https://doi.org/10.1021/jf0117107
. [all data]
Qian and Reineccius, 2002
Qian, M.; Reineccius, G.,
Identification of aroma compounds in Parmigiano-Reggiano cheese by gas chromatography/olfactometry,
J. Dairy Sci., 2002, 85, 6, 1362-1369, https://doi.org/10.3168/jds.S0022-0302(02)74202-1
. [all data]
Umano, Hagi, et al., 2002
Umano, K.; Hagi, Y.; Shibamoto, T.,
Volatile chemicals identified in extracts from newly hybrid citrus, dekopon (Shiranuhi mandarin Suppl. J.),
J. Agric. Food Chem., 2002, 50, 19, 5355-5359, https://doi.org/10.1021/jf0203951
. [all data]
Wei, Mura, et al., 2001
Wei, A.; Mura, K.; Shibamoto, T.,
Antioxidative activity of volatile chemicals extracted from beer,
J. Agric. Food Chem., 2001, 49, 8, 4097-4101, https://doi.org/10.1021/jf010325e
. [all data]
Girard and Lau, 1995
Girard, B.; Lau, O.L.,
Effect of maturity and storage on quality and volatile production of 'Jonagold' apples,
Food Res. Int., 1995, 28, 5, 465-471, https://doi.org/10.1016/0963-9969(96)81393-7
. [all data]
Umano, Hagi, et al., 1995
Umano, K.; Hagi, Y.; Nakahara, K.; Shyoji, A.; Shibamoto, T.,
Volatile chemicals formed in the headspace of a heated D-glucose/L-cysteine Maillard model system,
J. Agric. Food Chem., 1995, 43, 8, 2212-2218, https://doi.org/10.1021/jf00056a046
. [all data]
Chyau, Chen, et al., 1992
Chyau, C.-C.; Chen, S.-Y.; Wu, C.-M.,
Differences of volatile and nonvolatile constituents between mature and ripe guave (Psidium guajava Linn) fruits,
J. Agric. Food Chem., 1992, 40, 5, 846-849, https://doi.org/10.1021/jf00017a028
. [all data]
Takeoka and Butter, 1989
Takeoka, G.; Butter, R.G.,
Volatile constituents of pineapple (Ananas Comosus [L.] Merr.)
in Flavor Chemistry. Trends and Developments, Teranishi,R.; Buttery,R.G.; Shahidi,F., ed(s)., American Chemical Society, Washington, DC, 1989, 223-237. [all data]
Johanningsmeier and McFeeters, 2011
Johanningsmeier, S.D.; McFeeters, R.F.,
Detection of volatile spoilage metabolites in fermented cucumbers using nontargeted, comprehensive 2-dimensional gas chromatography-time-of-flight mass spectrometry (GCxGCxTOFMS),
J. Food Sci., 2011, 76, 1, c168-c177, https://doi.org/10.1111/j.1750-3841.2010.01918.x
. [all data]
Xiao, Dai, et al., 2011
Xiao, Z.; Dai, S.; Niu, Y.; Yu, H.; Zhu, J.; Tian, H.; Gu, Y.,
Discrimination of Chinese vinegars based on headspace solid-phase microextraction - gas chromatography mass spectrometry of volatile compounds and multivariate analysis,
J. Food Sci., 2011, 76, 8, c1125-c1135, https://doi.org/10.1111/j.1750-3841.2011.02356.x
. [all data]
Valappil, Fan, et al., 2009
Valappil, Z.A.; Fan, X.; Zhang, H.Q.; Rouseff, R.L.,
Impact of thermal and nonthermal processing technologies on unfermented apple cider aroma vilatiles,
J. Agric. Food Chem., 2009, 57, 3, 924-929, https://doi.org/10.1021/jf803142d
. [all data]
Berard, Bianchi, et al., 2007
Berard, J.; Bianchi, F.; Careri, M.; Chatel, A.; Mangia, A.; Musci, M.,
Characterization of the volatile fraction and of free fatty acids of Fontina Valle d'Aosta, a protected designation of origin Italian cheese,
Food Chem., 2007, 105, 1, 293-300, https://doi.org/10.1016/j.foodchem.2006.11.041
. [all data]
Tian, Zhang, et al., 2007
Tian, Y.; Zhang, X.; Huang, T.; Zou, K.; Zhou, J.,
Research advances on the essential oils from leaves of Eucalyptus,
Food Fermentation Ind. (Chinese), 2007, 33, 10, 143-147. [all data]
Garruti, Franco, et al., 2003
Garruti, D.S.; Franco, M.R.B.; da Silva, M.A.A.P.; Janzantti, N.S.; Alves, G.L.,
Evaluation of volatile flavour compounds from cashew apple (Anacardium occidentale L) juice by the Osme gas chromatography/olfactometry technique,
J. Sci. Food Agric., 2003, 83, 14, 1455-1462, https://doi.org/10.1002/jsfa.1560
. [all data]
Lopez, Lavilla, et al., 2000
Lopez, M.L.; Lavilla, M.T.; Recasens, I.; Graell, J.; Vendrell, M.,
Changes in aroma quality of 'Golden Delicious' apples after storage at different oxygen and carbon dioxide concentrations,
J. Sci. Food Agric., 2000, 80, 3, 311-324, https://doi.org/10.1002/1097-0010(200002)80:3<311::AID-JSFA519>3.0.CO;2-F
. [all data]
Lavilla, Puy, et al., 1999
Lavilla, T.; Puy, J.; López, M.L.; Recasens, I.; Vendrell, M.,
Relationships between volatile production, fruit quality, and sensory evaluation in Granny Smith apples stored in different controlled-atmosphere treatments by means of multivariate analysis,
J. Agric. Food Chem., 1999, 47, 9, 3791-3803, https://doi.org/10.1021/jf990066h
. [all data]
López, Lavilla, et al., 1998
López, M.L.; Lavilla, T.; Recasens, I.; Riba, M.; Vendrell, M.,
Influence of different oxygen and carbon dioxide concentrations during storage on production of volatile compounds by Starking delicious apples,
J. Agric. Food Chem., 1998, 46, 2, 634-643, https://doi.org/10.1021/jf9608938
. [all data]
Peng, Yang, et al., 1991
Peng, C.T.; Yang, Z.C.; Ding, S.F.,
Prediction of rentention idexes. II. Structure-retention index relationship on polar columns,
J. Chromatogr., 1991, 586, 1, 85-112, https://doi.org/10.1016/0021-9673(91)80028-F
. [all data]