CF3C≡CC≡CCF3
- Formula: C6F6
- Molecular weight: 186.0546
- IUPAC Standard InChIKey: IUMBVSOABSWHBN-UHFFFAOYSA-N
- CAS Registry Number: 10524-09-1
- Chemical structure:
View 3d structure (requires JavaScript / HTML 5) - Other names: 2,4-Hexadiyne, 1,1,1,6,6,6-hexafluoro-; 2,4-Hexadiyne, hexafluoro-; Perfluorohexa-2,4-diyne; Hexafluoro-2,4-hexadiyne; Hexafluorohexa-2,4-diyne

Gas phase ion energetics data

Data compiled as indicated in comments:
LLK - Sharon G. Lias, Rhoda D. Levin, and Sherif A. Kafafi
Ionization energy determinations
IE (eV) | Method | Reference | Comment |
---|---|---|---|
11.5 ± 0.1 | EI | Praet, Hubin-Franskin, et al., 1977 | LLK |
10.99 ± 0.01 | PE | Delwiche, Praet, et al., 1977 | LLK |
Appearance energy determinations

References

Praet, Hubin-Franskin, et al., 1977
Praet, M-Th.; Hubin-Franskin, M.J.; Delwiche, J.P.; Schoos, R.,
Ionization and dissociation of C6F6 isomers under electron impact,
Org. Mass Spectrom., 1977, 12, 297. [all data]
Delwiche, Praet, et al., 1977
Delwiche, J.P.; Praet, Th.; Caprace, G.; Hubin-Franskin, M-J.; Natalis, P.; Collin, J.E.,
The photoelectron spectra of perfluoro-2-butyne and perfluorohexa-2,4-diyne. The perfluorination effect,
J. Electron Spectrosc. Relat. Phenom., 1977, 12, 395. [all data]