Divinyldimethylsilane
- Formula: C6H12Si
- Molecular weight: 112.2450
- IUPAC Standard InChIKey: QRHCILLLMDEFSD-UHFFFAOYSA-N
- CAS Registry Number: 10519-87-6
- Chemical structure:
View 3d structure (requires JavaScript / HTML 5) - Other names: Silane, diethenyldimethyl-; Silane, dimethyl divinyl; dimethyldivinylsilane

Gas phase ion energetics data

Data compiled by: Sharon G. Lias, Rhoda D. Levin, and Sherif A. Kafafi
Ionization energy determinations
IE (eV) | Method | Reference | Comment |
---|---|---|---|
9.8 | PE | Schweig, Weidner, et al., 1973 | Vertical value |
9.8 | PE | Weidner and Schweig, 1972 | Vertical value |

Normal alkane RI, non-polar column, temperature ramp

Column type | Active phase | I | Reference | Comment |
---|---|---|---|---|
Capillary | OV-101 | 647. | Zenkevich, 2005 | 25. m/0.20 mm/0.10 μm, N2/He, 6. K/min; Tstart: 50. C; Tend: 250. C |

References

Schweig, Weidner, et al., 1973
Schweig, A.; Weidner, U.; Berger, J.G.; Grahn, W.,
Spirokonjugation,
Tetrahedron Lett., 1973, 557. [all data]
Weidner and Schweig, 1972
Weidner, U.; Schweig, A.,
Evidence for conjugation through a saturated silicon atom,
Angew. Chem. Int. Ed. Engl., 1972, 11, 536. [all data]
Zenkevich, 2005
Zenkevich, I.G.,
Experimentally measured retention indices., 2005. [all data]